devusb/nix-config-server build #11 failed ← #10 #12 →
eval warnings
3 kinds
· 7 occurrences
- warn `boot.zfs.forceImportRoot` is using the default value of `true`. It is highly recommended to set it to `false`, the new default from 26.11 on, to reduce the risk of data loss. Alternatively, you can silence this warning by explicitly setting it to `true`. ×5
- warn stdenv.isLinux is deprecated, use stdenv.hostPlatform.isLinux instead ×1
- warn stdenv.isDarwin is deprecated, use stdenv.hostPlatform.isDarwin instead ×1
2 failed ⚠ 1
| status | attribute | duration |
|---|---|---|
checks.x86_64-linux.nixos-spdr
|
7m 57s | |
intel-compute-runtime-legacy1-24.35.30872.41: [ 20%] Building CXX object shared/source/CMakeFiles/neo_shared.dir/os_interface/windows/power_settings_stub.cpp.o …intel-compute-runtime-legacy1-24.35.30872.41: [ 20%] Building CXX object shared/source/CMakeFiles/neo_shared.dir/os_interface/windows/power_settings_stub.cpp.o [ 20%] Building CXX object shared/source/CMakeFiles/neo_shared.dir/os_interface/windows/trim_callback_stub.cpp.o [ 20%] Building CXX object shared/source/CMakeFiles/neo_shared.dir/os_interface/windows/sys_calls_wrapper_drm_or_wddm.cpp.o [ 20%] Building CXX object shared/source/CMakeFiles/neo_shared.dir/os_interface/windows/wddm/perf_wddm.cpp.o [ 20%] Building CXX object shared/source/CMakeFiles/neo_shared.dir/sku_info/operations/windows/sku_info_receiver.cpp.o [ 20%] Linking CXX static library ../../lib/libneo_shared.a [ 20%] Built target neo_shared make: *** [Makefile:156: all] Error 2 linux-config-6.18.54: patching file drivers/platform/x86/apple-gmux.c applying patch /nix/store/8934vmb9zpazwazs2xi00wcjx1rwrsrs-3001-applesmc-convert-static-structures-to-drvdata.patch patching file drivers/hwmon/applesmc.c Hunk #47 FAILED at 1305. Hunk #48 succeeded at 1391 (offset 5 lines). Hunk #49 succeeded at 1496 (offset 5 lines). Hunk #50 succeeded at 1505 (offset 5 lines). 1 out of 50 hunks FAILED -- saving rejects to file drivers/hwmon/applesmc.c.rej |
||
checks.aarch64-linux.nixos-the-doctor
|
7m 53s | |
authentik-rust-2026.8.3: make[2]: *** [aws-lc/crypto/fipsmodule/CMakeFiles/bcm_hashunset.dir/build.make:380: aws-lc/crypto/fipsmodule/CMakeFiles/bcm_hashunset …authentik-rust-2026.8.3:
make[2]: *** [aws-lc/crypto/fipsmodule/CMakeFiles/bcm_hashunset.dir/build.make:380: aws-lc/crypto/fipsmodule/CMakeFiles/bcm_hashunset.dir/bcm-delocated.S.o] Error 1
make[1]: *** [CMakeFiles/Makefile2:403: aws-lc/crypto/fipsmodule/CMakeFiles/bcm_hashunset.dir/all] Error 2
make: *** [Makefile:136: all] Error 2
thread 'main' (2825) panicked at /build/authentik-rust-2026.8.3-vendor/source-registry-0/cmake-0.1.57/src/lib.rs:1132:5:
command did not execute successfully, got: exit status: 2
build script failed, must exit now
note: run with `RUST_BACKTRACE=1` environment variable to display a backtrace
warning: build failed, waiting for other jobs to finish...
|
||
10 succeeded ⚠ 5
| status | attribute | duration |
|---|---|---|
checks.aarch64-linux.nixos-gaia0
|
1h 37m | |
checks.aarch64-linux.nixos-gaia1
|
1h 37m | |
checks.aarch64-linux.nixos-sophia
|
6m 56s | |
checks.x86_64-linux.nixos-chopper
|
12m 17s | |
checks.x86_64-linux.sophia
|
1m 1s | |
checks.aarch64-darwin.darwin-cortana
|
33s | |
checks.aarch64-darwin.treefmt
|
5s | |
checks.aarch64-linux.nixos-superintendent
|
1h 41m | |
checks.aarch64-linux.treefmt
|
3s | |
checks.x86_64-linux.treefmt
|
0s |