devusb/nix-config-server build #9 failed ← #8 #10 →
eval warnings
4 kinds
· 7 occurrences
- warn `boot.zfs.forceImportRoot` is using the default value of `true`. It is highly recommended to set it to `false`, the new default from 26.11 on, to reduce the risk of data loss. Alternatively, you can silence this warning by explicitly setting it to `true`. ×4
- warn Receiving objects: 0% (1/807) Receiving objects: 1% (9/807) Receiving objects: 2% (17/807) Receiving objects: 3% (25/807) Receiving objects: 4% (33/807) Receiving objects: 5% (41/807) Receiving objects: 6% (49/807) Receiving objects: 7% (57/807) Receiving objects: 8% (65/807) Receiving objects: 9% (73/807) Receiving objects: 10% (81/807) Receiving objects: 11% (89/807) Receiving objects: 12% (97/807) Receiving objects: 13% (105/807) Receiving objects: 14% (113/807) Receiving objects: 15% (122/8… ×1
- warn stdenv.isLinux is deprecated, use stdenv.hostPlatform.isLinux instead ×1
- warn stdenv.isDarwin is deprecated, use stdenv.hostPlatform.isDarwin instead ×1
2 failed ⚠ 1
| status | attribute | duration |
|---|---|---|
checks.x86_64-linux.nixos-spdr
|
12s | |
linux-config-6.18.53: patching file drivers/platform/x86/apple-gmux.c applying patch /nix/store/8934vmb9zpazwazs2xi00wcjx1rwrsrs-3001-applesmc-convert-static-st …linux-config-6.18.53: patching file drivers/platform/x86/apple-gmux.c applying patch /nix/store/8934vmb9zpazwazs2xi00wcjx1rwrsrs-3001-applesmc-convert-static-structures-to-drvdata.patch patching file drivers/hwmon/applesmc.c Hunk #47 FAILED at 1305. Hunk #48 succeeded at 1391 (offset 5 lines). Hunk #49 succeeded at 1496 (offset 5 lines). Hunk #50 succeeded at 1505 (offset 5 lines). 1 out of 50 hunks FAILED -- saving rejects to file drivers/hwmon/applesmc.c.rej |
||
checks.aarch64-linux.nixos-the-doctor
|
3m 11s | |
authentik-rust-2026.8.3: make[2]: *** [aws-lc/crypto/fipsmodule/CMakeFiles/bcm_hashunset.dir/build.make:380: aws-lc/crypto/fipsmodule/CMakeFiles/bcm_hashunset …authentik-rust-2026.8.3:
make[2]: *** [aws-lc/crypto/fipsmodule/CMakeFiles/bcm_hashunset.dir/build.make:380: aws-lc/crypto/fipsmodule/CMakeFiles/bcm_hashunset.dir/bcm-delocated.S.o] Error 1
make[1]: *** [CMakeFiles/Makefile2:403: aws-lc/crypto/fipsmodule/CMakeFiles/bcm_hashunset.dir/all] Error 2
make: *** [Makefile:136: all] Error 2
thread 'main' (2617) panicked at /build/authentik-rust-2026.8.3-vendor/source-registry-0/cmake-0.1.57/src/lib.rs:1132:5:
command did not execute successfully, got: exit status: 2
build script failed, must exit now
note: run with `RUST_BACKTRACE=1` environment variable to display a backtrace
warning: build failed, waiting for other jobs to finish...
|
||
10 succeeded ⚠ 5
| status | attribute | duration |
|---|---|---|
checks.aarch64-linux.nixos-gaia0
|
1h 35m | |
checks.aarch64-linux.nixos-gaia1
|
1h 35m | |
checks.aarch64-linux.nixos-sophia
|
2m 5s | |
checks.x86_64-linux.nixos-chopper
|
29m 39s | |
checks.x86_64-linux.sophia
|
53s | |
checks.aarch64-darwin.darwin-cortana
|
53s | |
checks.aarch64-darwin.treefmt
|
4s | |
checks.aarch64-linux.nixos-superintendent
|
1h 39m | |
checks.aarch64-linux.treefmt
|
3s | |
checks.x86_64-linux.treefmt
|
1s |