nixbot

builds

devusb/nix-config build #45 failed

branch main · PR #702 · commit 1350d47e12 · · took 45m 16s · eval 4m 17s

eval warnings 6 kinds · 8 occurrences
  • warn trace: warning: mhelton profile: `programs.ssh.matchBlocks` defined in `/nix/store/…-source/home/mhelton/packages.nix' and `/nix/store/…-source/home/mhelton/work.nix' is deprecated. Use `programs.ssh.settings`. ×1
  • warn The option `hardware.logitech.wireless.enableGraphical' defined in `/nix/store/…-source/hosts/durandal' has been renamed to `programs.solaar.enable'. ×1
  • warn mhelton profile: `programs.ssh.matchBlocks` defined in `/nix/store/…-source/home/mhelton/packages.nix' and `/nix/store/…-source/home/mhelton/work.nix' is deprecated. Use `programs.ssh.settings`. ×3
  • warn 'appimageTools.extractType2' is deprecated, use 'appimageTools.extract' instead ×1
  • warn stdenv.isLinux is deprecated, use stdenv.hostPlatform.isLinux instead ×1
  • warn Scripted initrd is deprecated and scheduled for removal in 26.11. See the NixOS 26.05 release notes. ×1

6 failed ⚠ 3
failed attributes
status attribute duration
failed checks.x86_64-linux.nixos-bob
  • stdenv.isLinux is deprecated, use stdenv.hostPlatform.isLinux instead
  • Scripted initrd is deprecated and scheduled for removal in 26.11. See the NixOS 26.05 release notes.
39m 44s
setup: error: Cannot build '/nix/store/8q2xiscqmc7b26k1vfknlvdbwgfyn949-home-manager-files.drv'. Reason: 3 dependencies failed. Output paths: …
setup:
error: Cannot build '/nix/store/8q2xiscqmc7b26k1vfknlvdbwgfyn949-home-manager-files.drv'.
       Reason: 3 dependencies failed.
       Output paths:
         /nix/store/yhpcqfihmss8a67iskk85difgimnl97y-home-manager-files
error: Cannot build '/nix/store/afvz2d5l3qa223jz0p3fm07jk4yby3vn-hm-putter.json.drv'.
       Reason: 1 dependency failed.
       Output paths:
         /nix/store/p16qkvdsv2bf8wfm07pp7k055q5c22zm-hm-putter.json
error: Cannot build '/nix/store/5x1npk5craxppdyh34wbrdviqra71g00-home-manager-generation.drv'.
       Reason: 4 dependencies failed.
       Output paths:
         /nix/store/mh9j9hkz2nf7hp8k4iw2syqxgp1ghz5a-home-manager-generation
error: Cannot build '/nix/store/n8rv31xi3y9maq6mfk6qm2bxbcak20kx-unit-home-manager-mhelton.service.drv'.
       Reason: 1 dependency failed.
       Output paths:
         /nix/store/4n2lfyzkp3q96c5ycgdm69r9v76c6hv5-unit-home-manager-mhelton.service
error: Cannot build '/nix/store/zwwi5gwkszxdhja6raahsz428jnniyda-system-units.drv'.
       Reason: 1 dependency failed.
       Output paths:
         /nix/store/cjmk3zivx75xsdpdj4py14ay7c1cy8z1-system-units
error: Cannot build '/nix/store/l0n6n6v8jvyazahqwlnhgvcb7cylwgdp-etc.drv'.
       Reason: 2 dependencies failed.
       Output paths:
         /nix/store/bvmlaj2dnhyghq6l4yicav6qjf34glnp-etc
error: Cannot build '/nix/store/91j8828aa988wijz8ky9g07jyzvb9j5d-activate.drv'.
       Reason: 1 dependency failed.
       Output paths:
         /nix/store/47q93yp6yqa3sp5sijdfs0xsy3amjkd3-activate
error: Cannot build '/nix/store/zj7bfmgbx7q2r5j0qqwnmg8zp93v1iv7-nixos-system-bob-26.11.20260919.9e40872.drv'.
       Reason: 2 dependencies failed.
       Output paths:
         /nix/store/vw5yrj6f6sharc12hgmsnk0k3g5ccxar-nixos-system-bob-26.11.20260919.9e40872
failed checks.x86_64-linux.nixos-durandal
  • The option `hardware.logitech.wireless.enableGraphical' defined in `/nix/store/kp6ci056nmm33i712q81khw5ih5zr1i2-source/hosts/durandal' has been renamed to `programs.solaar.enable'.
39m 59s
setup: error: Cannot build '/nix/store/vjikxbdbl1p687r72adgh86jr3hi6hfv-home-manager-files.drv'. Reason: 3 dependencies failed. Output paths: …
setup:
error: Cannot build '/nix/store/vjikxbdbl1p687r72adgh86jr3hi6hfv-home-manager-files.drv'.
       Reason: 3 dependencies failed.
       Output paths:
         /nix/store/4kywksvwysvvbsbfhh67fgq6w2453pfr-home-manager-files
error: Cannot build '/nix/store/az1hwf2lb0qh94r03cy1gvcw9iqghxfw-hm-putter.json.drv'.
       Reason: 1 dependency failed.
       Output paths:
         /nix/store/18d4xa5x3n6cmgb77jmfzhjf6fq6nfjc-hm-putter.json
error: Cannot build '/nix/store/yfqj4pkdrp2h7bvq42g0yhyipvgrz50z-home-manager-generation.drv'.
       Reason: 4 dependencies failed.
       Output paths:
         /nix/store/k7pi9g7jnjfhif3mgwdr3yylpgrzmgfy-home-manager-generation
error: Cannot build '/nix/store/sr743b647ixzyqn2xl51mbxfqml6cq3q-unit-home-manager-mhelton.service.drv'.
       Reason: 1 dependency failed.
       Output paths:
         /nix/store/j6asjrhh80hab0g6gahfnicbhmigrg38-unit-home-manager-mhelton.service
error: Cannot build '/nix/store/lyk7c8h2rk11cz7gkgq2i4hby87jwm7p-system-units.drv'.
       Reason: 1 dependency failed.
       Output paths:
         /nix/store/hiza4sgimy1fl9jah8farwz4fk1ikiry-system-units
error: Cannot build '/nix/store/l0cpdix26p4hmxw5h4ln0dw1mwdnd1kz-etc.drv'.
       Reason: 2 dependencies failed.
       Output paths:
         /nix/store/qxlipn3z81g8fl5cyanqlhgrpycjrfhd-etc
error: Cannot build '/nix/store/whpl82anacj4jszzk5a8d4qsi367g5sp-activate.drv'.
       Reason: 1 dependency failed.
       Output paths:
         /nix/store/1ms4lbdfw7h8lpdwamcfpxlqd24b9ihs-activate
error: Cannot build '/nix/store/9lq7xxpy1mw7ib059m68lh49hvjh2g62-nixos-system-durandal-26.11.20260919.9e40872.drv'.
       Reason: 2 dependencies failed.
       Output paths:
         /nix/store/szn4wjx76pxdr4k1ks2c2rnln2fhk74q-nixos-system-durandal-26.11.20260919.9e40872
failed checks.x86_64-linux.nixos-mhelton-fw13
  • mhelton profile: `programs.ssh.matchBlocks` defined in `/nix/store/kp6ci056nmm33i712q81khw5ih5zr1i2-source/home/mhelton/packages.nix' and `/nix/store/kp6ci056nmm33i712q81khw5ih5zr1i2-source/home/mhelton/work.nix' is deprecated. Use `programs.ssh.settings`.
  • 'appimageTools.extractType2' is deprecated, use 'appimageTools.extract' instead
  • mhelton profile: `programs.ssh.matchBlocks` defined in `/nix/store/kp6ci056nmm33i712q81khw5ih5zr1i2-source/home/mhelton/packages.nix' and `/nix/store/kp6ci056nmm33i712q81khw5ih5zr1i2-source/home/mhelton/work.nix' is deprecated. Use `programs.ssh.settings`.
  • mhelton profile: `programs.ssh.matchBlocks` defined in `/nix/store/kp6ci056nmm33i712q81khw5ih5zr1i2-source/home/mhelton/packages.nix' and `/nix/store/kp6ci056nmm33i712q81khw5ih5zr1i2-source/home/mhelton/work.nix' is deprecated. Use `programs.ssh.settings`.
39m 46s
setup: error: Cannot build '/nix/store/mi36q9aqfpq9ac1328vchlngpdnd86f9-etc.drv'. Reason: 2 dependencies failed. Output paths: /nix/store …
setup:
error: Cannot build '/nix/store/mi36q9aqfpq9ac1328vchlngpdnd86f9-etc.drv'.
       Reason: 2 dependencies failed.
       Output paths:
         /nix/store/3pwzw623zw958q49chvqb6m3yd4l3mzz-etc
error: Cannot build '/nix/store/skgjk0fqmvjlnvjh3gwqmwvnicr95i82-etc.drv'.
       Reason: 2 dependencies failed.
       Output paths:
         /nix/store/6zviqgm116wrc5s6lq2fl4jwydkqyh0s-etc
error: Cannot build '/nix/store/4ch64x8m9xyjsk6llc720i059fx2lh9y-activate.drv'.
       Reason: 1 dependency failed.
       Output paths:
         /nix/store/srhcrxhlxzmijnkr8ib0ibbcpww1i9fk-activate
error: Cannot build '/nix/store/m7yz3kzxzlrmxzf2yszvr9372g7rrqy4-activate.drv'.
       Reason: 1 dependency failed.
       Output paths:
         /nix/store/p94aisscgr55nry41hjgxyxw5hw8amyw-activate
error: Cannot build '/nix/store/pw6wrmih0h0cfp6334i62y4rbip6d3xy-activate.drv'.
       Reason: 1 dependency failed.
       Output paths:
         /nix/store/szw50lpr60y3aj8hilzy4vrin3bghf23-activate
error: Cannot build '/nix/store/qz7vxq8bzgli5sc6bzdjnvnhpnr8k1df-nixos-system-mhelton-fw13-26.11.20260919.9e40872.drv'.
       Reason: 2 dependencies failed.
       Output paths:
         /nix/store/j4llsd3dj8yrqv1r9953iddkj368qxnm-nixos-system-mhelton-fw13-26.11.20260919.9e40872
error: Cannot build '/nix/store/scf9qhhrg1bg8372z7gyfcg2w28f3q8h-nixos-system-mhelton-fw13-26.11.20260919.9e40872.drv'.
       Reason: 2 dependencies failed.
       Output paths:
         /nix/store/mmvcl0dcna0l2qaiwy9z381asd5xf2s2-nixos-system-mhelton-fw13-26.11.20260919.9e40872
error: Cannot build '/nix/store/c8jmi02v3q9wamcv9dvp618hddij162a-nixos-system-mhelton-fw13-26.11.20260919.9e40872.drv'.
       Reason: 4 dependencies failed.
       Output paths:
         /nix/store/y3jm0d179cmjba63a69mnbs2vq3hdgxj-nixos-system-mhelton-fw13-26.11.20260919.9e40872
failed checks.aarch64-darwin.darwin-mhelton-mbp14 35m 23s
source: 100 71.89M 0 71.89M 0 0 21.19M 0 00:03 23.90M 100 104.2M 0 104.2M 0 0 23.68M 0 00:04 25. …
source:
100 71.89M   0 71.89M   0      0 21.19M      0           00:03         23.90M
100 104.2M   0 104.2M   0      0 23.68M      0           00:04         25.95M
100 131.7M   0 131.7M   0      0 24.38M      0           00:05         26.25M
100 143.2M   0 143.2M   0      0 22.36M      0           00:06         26.12M
100 144.1M   0 144.1M   0      0 21.98M      0           00:06         26.12M
100 144.1M   0 144.1M   0      0 21.98M      0           00:06         26.12M
100 144.1M   0 144.1M   0      0 21.98M      0           00:06         26.12M
unpacking source archive /nix/var/nix/builds/nix-89162-2708641736/download.tar.gz
failed checks.x86_64-linux.nixos-r2d2 40m 15s
setup: error: Cannot build '/nix/store/4mhbxd2qnmfd0lpwn4hgwbrszbqn372s-home-manager-files.drv'. Reason: 3 dependencies failed. Output paths: …
setup:
error: Cannot build '/nix/store/4mhbxd2qnmfd0lpwn4hgwbrszbqn372s-home-manager-files.drv'.
       Reason: 3 dependencies failed.
       Output paths:
         /nix/store/3amp1sa696ri6k9x08gpkz5bmsl4lwxr-home-manager-files
error: Cannot build '/nix/store/7bp45jji23ysgb0j92bc46bq13wwm7vz-hm-putter.json.drv'.
       Reason: 1 dependency failed.
       Output paths:
         /nix/store/8qib533v9kfcv54bdi27b70wzgkydi85-hm-putter.json
error: Cannot build '/nix/store/nnkjh4iin2b8v68qfh0f0d9bhprwdri4-home-manager-generation.drv'.
       Reason: 4 dependencies failed.
       Output paths:
         /nix/store/c8sa8b0615v2wnina9v9w7gqha8d8gbd-home-manager-generation
error: Cannot build '/nix/store/5rj3cjahpyb6vch17k4jb0532n6rq0yz-unit-home-manager-mhelton.service.drv'.
       Reason: 1 dependency failed.
       Output paths:
         /nix/store/blhmbz5ga069ll3472f57g1p1k8hmcv7-unit-home-manager-mhelton.service
error: Cannot build '/nix/store/lahrl76rp7fjclrbzd0z0q7gnb1zv75j-system-units.drv'.
       Reason: 1 dependency failed.
       Output paths:
         /nix/store/qsz54xcx1n4lndcwm9zh34grmck3aqsp-system-units
error: Cannot build '/nix/store/23yd5chnifaipyl4gxzh44dwnmwbh8z8-etc.drv'.
       Reason: 2 dependencies failed.
       Output paths:
         /nix/store/0gg9xf5dd978izzy4aaxz5w4jpaha9mr-etc
error: Cannot build '/nix/store/jiisik19m9sxxxs8grfyw7n2iji6qhb8-activate.drv'.
       Reason: 1 dependency failed.
       Output paths:
         /nix/store/zmv4c33rd07wksih4irirq5qvwk994dl-activate
error: Cannot build '/nix/store/v8y7d1s112qiqn6bixp72vrad78gca95-nixos-system-r2d2-26.11.20260919.9e40872.drv'.
       Reason: 2 dependencies failed.
       Output paths:
         /nix/store/kgbndz0f40p758rp7wwj85x1xb90ar26-nixos-system-r2d2-26.11.20260919.9e40872
failed checks.x86_64-linux.nixos-tomservo 39m 43s
setup: error: Cannot build '/nix/store/wdw60pnyynqilcvqsjfb3gzf27v50w02-etc.drv'. Reason: 2 dependencies failed. Output paths: /nix/store …
setup:
error: Cannot build '/nix/store/wdw60pnyynqilcvqsjfb3gzf27v50w02-etc.drv'.
       Reason: 2 dependencies failed.
       Output paths:
         /nix/store/8zjskj3hpxsn6xf503byq3l8978d6kn3-etc
error: Cannot build '/nix/store/xbgx3r1vcr5ks5hvz4gcqwks8zgygj7s-etc.drv'.
       Reason: 2 dependencies failed.
       Output paths:
         /nix/store/r3lkkg3icwxxvbwdz3rfva25xcz78ff3-etc
error: Cannot build '/nix/store/8djlfvhazxy20csx5ydqv9fynyljv140-activate.drv'.
       Reason: 1 dependency failed.
       Output paths:
         /nix/store/6zvdsxgjmdh62xqk8x5g5adnhlp16fj8-activate
error: Cannot build '/nix/store/lsig66wy9dnyj0knwrcbx9pm1am6xd1a-activate.drv'.
       Reason: 1 dependency failed.
       Output paths:
         /nix/store/4jy9922kx0g0k517afrd70rs535p3m9n-activate
error: Cannot build '/nix/store/vhj8sr4ziswcd2m3ijdj0d3s9w4iy14d-activate.drv'.
       Reason: 1 dependency failed.
       Output paths:
         /nix/store/n9ynqsph74rjnka5yj64lbdjp4cw7r7a-activate
error: Cannot build '/nix/store/6lfiskih1zfr1qa836askmpi0w0f26jn-nixos-system-tomservo-26.11.20260919.9e40872.drv'.
       Reason: 2 dependencies failed.
       Output paths:
         /nix/store/2fjad72l9rzm71a6ibzm0sgdrc9pwx8i-nixos-system-tomservo-26.11.20260919.9e40872
error: Cannot build '/nix/store/x5kl2agbw7jmki9llkbf418x4wn0yafc-nixos-system-tomservo-26.11.20260919.9e40872.drv'.
       Reason: 2 dependencies failed.
       Output paths:
         /nix/store/zrnxyl23ikd9fvkypikmvbyya0xyd8wg-nixos-system-tomservo-26.11.20260919.9e40872
error: Cannot build '/nix/store/00qawivqibg96sjn1vl01kvz1lpmn6p5-nixos-system-tomservo-26.11.20260919.9e40872.drv'.
       Reason: 4 dependencies failed.
       Output paths:
         /nix/store/5qcrlimb216y4857n74z36854lklnym6-nixos-system-tomservo-26.11.20260919.9e40872
6 succeeded
succeeded attributes
status attribute duration
loading…