nixbot

builds

failed authentik-rust-2026.8.3 checks.aarch64-linux.nixos-the-doctor · build #9 · raw

1structuredAttrs is enabled
unpackPhase
2unpacking source archive /nix/store/wcn9b7bkf11vg2rdn51gbiir8cf4l60h-source3source root is source4Executing cargoSetupPostUnpackHook5Finished cargoSetupPostUnpackHook
patchPhase
6Executing cargoSetupPostPatchHook7Validating consistency between /build/source/Cargo.lock and /build/authentik-rust-2026.8.3-vendor/Cargo.lock8Finished cargoSetupPostPatchHook
buildPhase
9Executing cargoBuildHook10cargoBuildHook flags: -j 4 --target aarch64-unknown-linux-gnu --offline --profile release --package authentik --no-default-features --features core --locked11 Compiling proc-macro2 v1.0.10612 Compiling quote v1.0.4513 Compiling unicode-ident v1.0.2414 Compiling serde v1.0.22915 Compiling libc v0.2.18616 Compiling cfg-if v1.0.417 Compiling serde_core v1.0.22918 Compiling syn v2.0.11719 Compiling syn v3.0.320 Compiling memchr v2.8.021 Compiling shlex v1.3.022 Compiling jobserver v0.1.3423 Compiling find-msvc-tools v0.1.924 Compiling cc v1.2.5725 Compiling serde_derive v1.0.22926 Compiling synstructure v0.13.227 Compiling once_cell v1.21.428 Compiling itoa v1.0.1829 Compiling pin-project-lite v0.2.1730 Compiling pkg-config v0.3.3231 Compiling log v0.4.2932 Compiling parking_lot_core v0.9.1233 Compiling tracing-core v0.1.3634 Compiling zerofrom-derive v0.1.635 Compiling yoke-derive v0.8.136 Compiling tracing-attributes v0.1.3137 Compiling smallvec v1.15.138 Compiling zerovec-derive v0.11.239 Compiling displaydoc v0.2.540 Compiling bytes v1.11.141 Compiling tracing v0.1.4442 Compiling cmake v0.1.5743 Compiling fs_extra v1.3.044 Compiling dunce v1.0.545 Compiling zmij v1.0.2146 Compiling either v1.15.047 Compiling futures-core v0.3.3348 Compiling scopeguard v1.2.049 Compiling serde_json v1.0.15150 Compiling percent-encoding v2.3.251 Compiling lock_api v0.4.1452 Compiling aws-lc-sys v0.45.053 Compiling icu_normalizer_data v2.1.154 Compiling version_check v0.9.555 Compiling icu_properties_data v2.1.256 Compiling parking_lot v0.12.557 Compiling thiserror-impl v2.0.1958 Compiling slab v0.4.1259 Compiling mio v1.2.060 Compiling errno v0.3.1461 Compiling glob v0.3.462 Compiling signal-hook-registry v1.4.863 Compiling generic-array v0.14.764 Compiling itertools v0.13.065 Compiling zerofrom v0.1.666 Compiling tokio-macros v2.7.067 Compiling socket2 v0.6.368 Compiling futures-sink v0.3.3369 Compiling typenum v1.20.070 Compiling stable_deref_trait v1.2.171 Compiling yoke v0.8.172 Compiling tokio v1.53.173 Compiling futures-channel v0.3.3374 Compiling futures-macro v0.3.3375 Compiling futures-task v0.3.3376 Compiling futures-io v0.3.3377 Compiling thiserror v2.0.1978 Compiling rustc-hash v2.1.179 Compiling zerovec v0.11.580 Compiling clang-sys v1.8.181 Compiling futures-util v0.3.3382 Compiling bitflags v2.11.083 Compiling autocfg v1.5.084 Compiling prettyplease v0.2.3785 Compiling subtle v2.6.186 Compiling getrandom v0.4.287 Compiling aho-corasick v1.1.488 Compiling equivalent v1.0.289 Compiling zerocopy v0.8.4790 Compiling minimal-lexical v0.2.191 Compiling regex-syntax v0.8.1192 Compiling http v1.4.093 Compiling nom v7.1.394 Compiling regex-automata v0.4.1695 Compiling libloading v0.8.996 Compiling bindgen v0.72.197 Compiling foldhash v0.2.098 Compiling allocator-api2 v0.2.2199 Compiling hashbrown v0.16.1100 Compiling regex v1.13.1101 Compiling cexpr v0.6.0102 Compiling tinystr v0.8.2103 Compiling form_urlencoded v1.2.2104 Compiling litemap v0.8.1105 Compiling writeable v0.6.2106 Compiling icu_locale_core v2.1.1107 Compiling potential_utf v0.1.4108 Compiling zerotrie v0.2.3109 Compiling foldhash v0.1.5110 Compiling getrandom v0.3.4111 Compiling hashbrown v0.15.5112 Compiling ppv-lite86 v0.2.21113 Compiling icu_provider v2.1.1114 Compiling icu_collections v2.1.1115 Compiling zeroize_derive v1.5.0116 Compiling num-conv v0.2.2117 Compiling base64 v0.22.1118 Compiling time-core v0.1.9119 Compiling time-macros v0.2.32120 Compiling zeroize v1.8.2121 Compiling indexmap v2.13.0122 Compiling powerfmt v0.2.0123 Compiling rand_core v0.10.1124 Compiling deranged v0.5.8125 Compiling num_threads v0.1.7126 Compiling rand_core v0.9.5127 Compiling icu_properties v2.1.2128 Compiling time v0.3.54129 Compiling icu_normalizer v2.1.1130 Compiling aws-lc-fips-sys v0.14.2131 Compiling httparse v1.10.1132 Compiling aws-lc-rs v1.18.1133 Compiling idna_adapter v1.2.1134 Compiling http-body v1.0.1135 Compiling tower-service v0.3.3136 Compiling utf8_iter v1.0.4137 Compiling idna v1.1.0138 Compiling rand_chacha v0.9.0139 Compiling rustls-pki-types v1.14.0140 Compiling tokio-util v0.7.19141 Compiling crossbeam-utils v0.8.21142 Compiling rand v0.9.4143 Compiling url v2.5.8144 Compiling untrusted v0.7.1145 Compiling block-buffer v0.10.4146 Compiling crypto-common v0.1.7147 Compiling ipnet v2.12.0148 Compiling digest v0.10.7149 Compiling uuid v1.24.0150 Compiling try-lock v0.2.5151 Compiling atomic-waker v1.1.2152 Compiling fnv v1.0.7153 Compiling httpdate v1.0.3154 Compiling h2 v0.4.16155 Compiling want v0.3.1156 Compiling untrusted v0.9.0157 Compiling rustls v0.23.45158 Compiling tower-layer v0.3.3159 Compiling num-traits v0.2.19160 Compiling cpufeatures v0.2.17161 Compiling sync_wrapper v1.0.2162 Compiling hyper v1.11.0163 Compiling hyper-util v0.1.20164 Compiling adler2 v2.0.1165 Compiling simd-adler32 v0.3.9166 Compiling mime v0.3.17167 Compiling miniz_oxide v0.8.9168 Compiling http-body-util v0.1.4169 Compiling hybrid-array v0.4.12170 Compiling anyhow v1.0.102171 Compiling hex v0.4.3172 Compiling cmov v0.5.4173 Compiling ctutils v0.4.2174 Compiling crypto-common v0.2.2175 Compiling block-buffer v0.12.0176 Compiling tower v0.5.3177 Compiling ryu v1.0.23178 Compiling const-oid v0.10.2179 Compiling digest v0.11.3180 Compiling serde_urlencoded v0.7.1181 Compiling debugid v0.8.0182 Compiling target-lexicon v0.13.5183 Compiling lazy_static v1.5.0184 Compiling data-encoding v2.10.0185 Compiling sharded-slab v0.1.7186 Compiling sentry-types v0.48.5187 Compiling matchers v0.2.0188 Compiling tracing-serde v0.2.0189 Compiling tracing-log v0.2.0190 Compiling thread_local v1.1.9191 Compiling nu-ansi-term v0.50.3192 Compiling rustversion v1.0.22193 Compiling object v0.37.3194 Compiling unicase v2.9.0195 Compiling crc32fast v1.5.0196 Compiling mime_guess v2.0.5197 Compiling tracing-subscriber v0.3.23198 Compiling sentry-core v0.48.5199 Compiling sha1 v0.10.6200 Compiling concurrent-queue v2.5.0201 Compiling tokio-stream v0.1.18202 Compiling zstd-sys v2.0.16+zstd.1.5.7203 Compiling parking v2.2.1204 Compiling gimli v0.32.3205 Compiling openssl-probe v0.2.1206 Compiling tinyvec_macros v0.1.1207 Compiling tinyvec v1.11.0208 Compiling rustls-native-certs v0.8.3209 Compiling addr2line v0.25.1210 Compiling event-listener v5.4.1211 Compiling tungstenite v0.29.0212warning: [email protected]: Emitting configuration: cargo:rustc-cfg=aarch64_unknown_linux_gnu213warning: [email protected]: Building with: CMake214warning: [email protected]: Symbol Prefix: Some("aws_lc_fips_0_14_2")215warning: [email protected]: Target platform: 'aarch64-unknown-linux-gnu'216warning: [email protected]: Compilation of 'c11.c' succeeded - Ok(["/build/source/target/aarch64-unknown-linux-gnu/release/build/aws-lc-fips-sys-996b9b2f671df0c5/out/out-c11/7dfda64fdf5a526c-c11.o"]).217warning: [email protected]: Environment Variable found 'AWS_LC_FIPS_SYS_HOST_CC': '/nix/store/7v2w6x6h13zzswz6agxxcrx73vqdd0px-clang-wrapper-21.1.8/bin/cc'218warning: [email protected]: Environment Variable found 'HOST_CC': '/nix/store/z2qkl46kv87zcs2sfwfjgc75nq0hbzhf-gcc-wrapper-15.3.0/bin/cc'219warning: [email protected]: Environment Variable found 'CC': 'clang'220warning: [email protected]: Setting CC_aarch64_unknown_linux_gnu: /nix/store/7v2w6x6h13zzswz6agxxcrx73vqdd0px-clang-wrapper-21.1.8/bin/cc221warning: [email protected]: Environment Variable found 'HOST_CXX': '/nix/store/z2qkl46kv87zcs2sfwfjgc75nq0hbzhf-gcc-wrapper-15.3.0/bin/c++'222warning: [email protected]: Environment Variable found 'CXX': 'clang++'223warning: [email protected]: Setting CXX_aarch64_unknown_linux_gnu: /nix/store/z2qkl46kv87zcs2sfwfjgc75nq0hbzhf-gcc-wrapper-15.3.0/bin/c++224warning: [email protected]: Using flag: -ffile-prefix-map="/build/authentik-rust-2026.8.3-vendor/source-registry-0/aws-lc-fips-sys-0.14.2"=225error: failed to run custom build command for `aws-lc-fips-sys v0.14.2`226227Caused by:228 process didn't exit successfully: `/build/source/target/release/build/aws-lc-fips-sys-27eb10ecfb057092/build-script-main` (exit status: 101)229 --- stdout230 cargo:rerun-if-env-changed=AWS_LC_FIPS_SYS_NO_PREFIX_aarch64_unknown_linux_gnu231 cargo:rerun-if-env-changed=AWS_LC_FIPS_SYS_NO_PREFIX232 cargo:rerun-if-env-changed=AWS_LC_FIPS_SYS_PREGENERATING_BINDINGS_aarch64_unknown_linux_gnu233 cargo:rerun-if-env-changed=AWS_LC_FIPS_SYS_PREGENERATING_BINDINGS234 cargo:rerun-if-env-changed=AWS_LC_FIPS_SYS_EXTERNAL_BINDGEN_aarch64_unknown_linux_gnu235 cargo:rerun-if-env-changed=AWS_LC_FIPS_SYS_EXTERNAL_BINDGEN236 cargo:rerun-if-env-changed=AWS_LC_FIPS_SYS_NO_ASM_aarch64_unknown_linux_gnu237 cargo:rerun-if-env-changed=AWS_LC_FIPS_SYS_NO_ASM238 cargo:rerun-if-env-changed=AWS_LC_FIPS_SYS_PREBUILT_NASM_aarch64_unknown_linux_gnu239 cargo:rerun-if-env-changed=AWS_LC_FIPS_SYS_PREBUILT_NASM240 cargo:rerun-if-env-changed=AWS_LC_FIPS_SYS_C_STD_aarch64_unknown_linux_gnu241 cargo:rerun-if-env-changed=AWS_LC_FIPS_SYS_C_STD242 cargo:rerun-if-env-changed=AWS_LC_FIPS_SYS_CMAKE_BUILDER_aarch64_unknown_linux_gnu243 cargo:rerun-if-env-changed=AWS_LC_FIPS_SYS_CMAKE_BUILDER244 cargo:rerun-if-env-changed=AWS_LC_FIPS_SYS_NO_PREGENERATED_SRC_aarch64_unknown_linux_gnu245 cargo:rerun-if-env-changed=AWS_LC_FIPS_SYS_NO_PREGENERATED_SRC246 cargo:rerun-if-env-changed=AWS_LC_FIPS_SYS_SMALL_aarch64_unknown_linux_gnu247 cargo:rerun-if-env-changed=AWS_LC_FIPS_SYS_SMALL248 cargo:rerun-if-env-changed=AWS_LC_FIPS_SYS_EFFECTIVE_TARGET_aarch64_unknown_linux_gnu249 cargo:rerun-if-env-changed=AWS_LC_FIPS_SYS_EFFECTIVE_TARGET250 cargo:rerun-if-env-changed=AWS_LC_FIPS_SYS_NO_JITTER_ENTROPY_aarch64_unknown_linux_gnu251 cargo:rerun-if-env-changed=AWS_LC_FIPS_SYS_NO_JITTER_ENTROPY252 cargo:rerun-if-env-changed=AWS_LC_FIPS_SYS_NO_U1_BINDINGS_aarch64_unknown_linux_gnu253 cargo:rerun-if-env-changed=AWS_LC_FIPS_SYS_NO_U1_BINDINGS254 cargo:rerun-if-env-changed=AWS_LC_FIPS_SYS_INCLUDES_aarch64_unknown_linux_gnu255 cargo:rerun-if-env-changed=AWS_LC_FIPS_SYS_INCLUDES256 cargo:rerun-if-env-changed=AWS_LC_FIPS_SYS_SANITIZER_aarch64_unknown_linux_gnu257 cargo:rerun-if-env-changed=AWS_LC_FIPS_SYS_SANITIZER258 cargo:rerun-if-env-changed=AWS_LC_FIPS_SYS_LINK_WHOLE_ARCHIVE_aarch64_unknown_linux_gnu259 cargo:rerun-if-env-changed=AWS_LC_FIPS_SYS_LINK_WHOLE_ARCHIVE260 cargo:rerun-if-env-changed=AWS_LC_FIPS_SYS_STATIC_aarch64_unknown_linux_gnu261 cargo:rerun-if-env-changed=AWS_LC_FIPS_SYS_STATIC262 cargo:rerun-if-env-changed=AWS_LC_FIPS_SYS_SYSTEM_DIR_aarch64_unknown_linux_gnu263 cargo:rerun-if-env-changed=AWS_LC_FIPS_SYS_SYSTEM_DIR264 cargo:rerun-if-env-changed=AWS_LC_FIPS_SYS_USE_SYSTEM_aarch64_unknown_linux_gnu265 cargo:rerun-if-env-changed=AWS_LC_FIPS_SYS_USE_SYSTEM266 cargo:rerun-if-env-changed=AWS_LC_FIPS_SYS_SYSTEM_BINDINGS_aarch64_unknown_linux_gnu267 cargo:rerun-if-env-changed=AWS_LC_FIPS_SYS_SYSTEM_BINDINGS268 cargo:rerun-if-env-changed=AWS_LC_FIPS_SYS_SYSTEM_SKIP_VERSION_CHECK_aarch64_unknown_linux_gnu269 cargo:rerun-if-env-changed=AWS_LC_FIPS_SYS_SYSTEM_SKIP_VERSION_CHECK270 cargo:warning=Emitting configuration: cargo:rustc-cfg=aarch64_unknown_linux_gnu271 cargo:rustc-cfg=aarch64_unknown_linux_gnu272 cargo:rerun-if-env-changed=OPENSSL_DIR_aarch64_unknown_linux_gnu273 cargo:rerun-if-env-changed=OPENSSL_DIR274 cargo:rerun-if-env-changed=OPENSSL_INCLUDE_DIR_aarch64_unknown_linux_gnu275 cargo:rerun-if-env-changed=OPENSSL_INCLUDE_DIR276 cargo:rerun-if-env-changed=OPENSSL_LIB_DIR_aarch64_unknown_linux_gnu277 cargo:rerun-if-env-changed=OPENSSL_LIB_DIR278 cargo:rerun-if-env-changed=OPENSSL_NO_PKG_CONFIG279 cargo:rerun-if-env-changed=PKG_CONFIG_aarch64-unknown-linux-gnu280 cargo:rerun-if-env-changed=PKG_CONFIG_aarch64_unknown_linux_gnu281 cargo:rerun-if-env-changed=HOST_PKG_CONFIG282 cargo:rerun-if-env-changed=PKG_CONFIG283 cargo:rerun-if-env-changed=OPENSSL_STATIC284 cargo:rerun-if-env-changed=OPENSSL_DYNAMIC285 cargo:rerun-if-env-changed=PKG_CONFIG_ALL_STATIC286 cargo:rerun-if-env-changed=PKG_CONFIG_ALL_DYNAMIC287 cargo:rerun-if-env-changed=PKG_CONFIG_PATH_aarch64-unknown-linux-gnu288 cargo:rerun-if-env-changed=PKG_CONFIG_PATH_aarch64_unknown_linux_gnu289 cargo:rerun-if-env-changed=HOST_PKG_CONFIG_PATH290 cargo:rerun-if-env-changed=PKG_CONFIG_PATH291 cargo:rerun-if-env-changed=PKG_CONFIG_LIBDIR_aarch64-unknown-linux-gnu292 cargo:rerun-if-env-changed=PKG_CONFIG_LIBDIR_aarch64_unknown_linux_gnu293 cargo:rerun-if-env-changed=HOST_PKG_CONFIG_LIBDIR294 cargo:rerun-if-env-changed=PKG_CONFIG_LIBDIR295 cargo:rerun-if-env-changed=PKG_CONFIG_SYSROOT_DIR_aarch64-unknown-linux-gnu296 cargo:rerun-if-env-changed=PKG_CONFIG_SYSROOT_DIR_aarch64_unknown_linux_gnu297 cargo:rerun-if-env-changed=HOST_PKG_CONFIG_SYSROOT_DIR298 cargo:rerun-if-env-changed=PKG_CONFIG_SYSROOT_DIR299 cargo:rerun-if-env-changed=AWS_LC_NO_PKG_CONFIG300 cargo:rerun-if-env-changed=PKG_CONFIG_aarch64-unknown-linux-gnu301 cargo:rerun-if-env-changed=PKG_CONFIG_aarch64_unknown_linux_gnu302 cargo:rerun-if-env-changed=HOST_PKG_CONFIG303 cargo:rerun-if-env-changed=PKG_CONFIG304 cargo:rerun-if-env-changed=AWS_LC_STATIC305 cargo:rerun-if-env-changed=AWS_LC_DYNAMIC306 cargo:rerun-if-env-changed=PKG_CONFIG_ALL_STATIC307 cargo:rerun-if-env-changed=PKG_CONFIG_ALL_DYNAMIC308 cargo:rerun-if-env-changed=PKG_CONFIG_PATH_aarch64-unknown-linux-gnu309 cargo:rerun-if-env-changed=PKG_CONFIG_PATH_aarch64_unknown_linux_gnu310 cargo:rerun-if-env-changed=HOST_PKG_CONFIG_PATH311 cargo:rerun-if-env-changed=PKG_CONFIG_PATH312 cargo:rerun-if-env-changed=PKG_CONFIG_LIBDIR_aarch64-unknown-linux-gnu313 cargo:rerun-if-env-changed=PKG_CONFIG_LIBDIR_aarch64_unknown_linux_gnu314 cargo:rerun-if-env-changed=HOST_PKG_CONFIG_LIBDIR315 cargo:rerun-if-env-changed=PKG_CONFIG_LIBDIR316 cargo:rerun-if-env-changed=PKG_CONFIG_SYSROOT_DIR_aarch64-unknown-linux-gnu317 cargo:rerun-if-env-changed=PKG_CONFIG_SYSROOT_DIR_aarch64_unknown_linux_gnu318 cargo:rerun-if-env-changed=HOST_PKG_CONFIG_SYSROOT_DIR319 cargo:rerun-if-env-changed=PKG_CONFIG_SYSROOT_DIR320 cargo:rerun-if-env-changed=LIBCRYPTO_NO_PKG_CONFIG321 cargo:rerun-if-env-changed=PKG_CONFIG_aarch64-unknown-linux-gnu322 cargo:rerun-if-env-changed=PKG_CONFIG_aarch64_unknown_linux_gnu323 cargo:rerun-if-env-changed=HOST_PKG_CONFIG324 cargo:rerun-if-env-changed=PKG_CONFIG325 cargo:rerun-if-env-changed=LIBCRYPTO_STATIC326 cargo:rerun-if-env-changed=LIBCRYPTO_DYNAMIC327 cargo:rerun-if-env-changed=PKG_CONFIG_ALL_STATIC328 cargo:rerun-if-env-changed=PKG_CONFIG_ALL_DYNAMIC329 cargo:rerun-if-env-changed=PKG_CONFIG_PATH_aarch64-unknown-linux-gnu330 cargo:rerun-if-env-changed=PKG_CONFIG_PATH_aarch64_unknown_linux_gnu331 cargo:rerun-if-env-changed=HOST_PKG_CONFIG_PATH332 cargo:rerun-if-env-changed=PKG_CONFIG_PATH333 cargo:rerun-if-env-changed=PKG_CONFIG_LIBDIR_aarch64-unknown-linux-gnu334 cargo:rerun-if-env-changed=PKG_CONFIG_LIBDIR_aarch64_unknown_linux_gnu335 cargo:rerun-if-env-changed=HOST_PKG_CONFIG_LIBDIR336 cargo:rerun-if-env-changed=PKG_CONFIG_LIBDIR337 cargo:rerun-if-env-changed=PKG_CONFIG_SYSROOT_DIR_aarch64-unknown-linux-gnu338 cargo:rerun-if-env-changed=PKG_CONFIG_SYSROOT_DIR_aarch64_unknown_linux_gnu339 cargo:rerun-if-env-changed=HOST_PKG_CONFIG_SYSROOT_DIR340 cargo:rerun-if-env-changed=PKG_CONFIG_SYSROOT_DIR341 cargo:rerun-if-env-changed=LIBCRYPTO_AWSLC_NO_PKG_CONFIG342 cargo:rerun-if-env-changed=PKG_CONFIG_aarch64-unknown-linux-gnu343 cargo:rerun-if-env-changed=PKG_CONFIG_aarch64_unknown_linux_gnu344 cargo:rerun-if-env-changed=HOST_PKG_CONFIG345 cargo:rerun-if-env-changed=PKG_CONFIG346 cargo:rerun-if-env-changed=LIBCRYPTO_AWSLC_STATIC347 cargo:rerun-if-env-changed=LIBCRYPTO_AWSLC_DYNAMIC348 cargo:rerun-if-env-changed=PKG_CONFIG_ALL_STATIC349 cargo:rerun-if-env-changed=PKG_CONFIG_ALL_DYNAMIC350 cargo:rerun-if-env-changed=PKG_CONFIG_PATH_aarch64-unknown-linux-gnu351 cargo:rerun-if-env-changed=PKG_CONFIG_PATH_aarch64_unknown_linux_gnu352 cargo:rerun-if-env-changed=HOST_PKG_CONFIG_PATH353 cargo:rerun-if-env-changed=PKG_CONFIG_PATH354 cargo:rerun-if-env-changed=PKG_CONFIG_LIBDIR_aarch64-unknown-linux-gnu355 cargo:rerun-if-env-changed=PKG_CONFIG_LIBDIR_aarch64_unknown_linux_gnu356 cargo:rerun-if-env-changed=HOST_PKG_CONFIG_LIBDIR357 cargo:rerun-if-env-changed=PKG_CONFIG_LIBDIR358 cargo:rerun-if-env-changed=PKG_CONFIG_SYSROOT_DIR_aarch64-unknown-linux-gnu359 cargo:rerun-if-env-changed=PKG_CONFIG_SYSROOT_DIR_aarch64_unknown_linux_gnu360 cargo:rerun-if-env-changed=HOST_PKG_CONFIG_SYSROOT_DIR361 cargo:rerun-if-env-changed=PKG_CONFIG_SYSROOT_DIR362 cargo:warning=Building with: CMake363 cargo:warning=Symbol Prefix: Some("aws_lc_fips_0_14_2")364 cargo:rerun-if-env-changed=AWS_LC_FIPS_SYS_CMAKE_aarch64_unknown_linux_gnu365 cargo:rerun-if-env-changed=AWS_LC_FIPS_SYS_CMAKE366 cargo:rerun-if-env-changed=CMAKE_aarch64_unknown_linux_gnu367 cargo:rerun-if-env-changed=CMAKE368 cargo:warning=Target platform: 'aarch64-unknown-linux-gnu'369 cargo:rerun-if-env-changed=AWS_LC_FIPS_SYS_CMAKE_GENERATOR_aarch64_unknown_linux_gnu370 cargo:rerun-if-env-changed=AWS_LC_FIPS_SYS_CMAKE_GENERATOR371 cargo:rerun-if-env-changed=CMAKE_GENERATOR_aarch64_unknown_linux_gnu372 cargo:rerun-if-env-changed=CMAKE_GENERATOR373 cargo:rerun-if-env-changed=AWS_LC_FIPS_SYS_HOST_CFLAGS_aarch64_unknown_linux_gnu374 cargo:rerun-if-env-changed=AWS_LC_FIPS_SYS_HOST_CFLAGS375 cargo:rerun-if-env-changed=HOST_CFLAGS_aarch64_unknown_linux_gnu376 cargo:rerun-if-env-changed=HOST_CFLAGS377 cargo:rerun-if-env-changed=AWS_LC_FIPS_SYS_CFLAGS_aarch64_unknown_linux_gnu378 cargo:rerun-if-env-changed=AWS_LC_FIPS_SYS_CFLAGS379 cargo:rerun-if-env-changed=CFLAGS_aarch64_unknown_linux_gnu380 cargo:rerun-if-env-changed=CFLAGS381 cargo:rerun-if-env-changed=AWS_LC_FIPS_SYS_HOST_CFLAGS_aarch64_unknown_linux_gnu382 cargo:rerun-if-env-changed=AWS_LC_FIPS_SYS_HOST_CFLAGS383 cargo:rerun-if-env-changed=HOST_CFLAGS_aarch64_unknown_linux_gnu384 cargo:rerun-if-env-changed=HOST_CFLAGS385 cargo:rerun-if-env-changed=AWS_LC_FIPS_SYS_CFLAGS_aarch64_unknown_linux_gnu386 cargo:rerun-if-env-changed=AWS_LC_FIPS_SYS_CFLAGS387 cargo:rerun-if-env-changed=CFLAGS_aarch64_unknown_linux_gnu388 cargo:rerun-if-env-changed=CFLAGS389 cargo:rerun-if-env-changed=AWS_LC_FIPS_SYS_CMAKE_TOOLCHAIN_FILE_aarch64_unknown_linux_gnu390 cargo:rerun-if-env-changed=AWS_LC_FIPS_SYS_CMAKE_TOOLCHAIN_FILE391 cargo:rerun-if-env-changed=CMAKE_TOOLCHAIN_FILE_aarch64_unknown_linux_gnu392 cargo:rerun-if-env-changed=CMAKE_TOOLCHAIN_FILE393 cargo:rerun-if-env-changed=CC_aarch64-unknown-linux-gnu394 CC_aarch64-unknown-linux-gnu = None395 cargo:rerun-if-env-changed=CC_aarch64_unknown_linux_gnu396 CC_aarch64_unknown_linux_gnu = None397 cargo:rerun-if-env-changed=HOST_CC398 HOST_CC = Some(/nix/store/z2qkl46kv87zcs2sfwfjgc75nq0hbzhf-gcc-wrapper-15.3.0/bin/cc)399 cargo:rerun-if-env-changed=CC_ENABLE_DEBUG_OUTPUT400 cargo:rerun-if-env-changed=CRATE_CC_NO_DEFAULTS401 CRATE_CC_NO_DEFAULTS = None402 cargo:rerun-if-env-changed=CFLAGS403 CFLAGS = None404 cargo:rerun-if-env-changed=HOST_CFLAGS405 HOST_CFLAGS = None406 cargo:rerun-if-env-changed=CFLAGS_aarch64_unknown_linux_gnu407 CFLAGS_aarch64_unknown_linux_gnu = None408 cargo:rerun-if-env-changed=CFLAGS_aarch64-unknown-linux-gnu409 CFLAGS_aarch64-unknown-linux-gnu = None410 cargo:rerun-if-env-changed=CC_aarch64-unknown-linux-gnu411 CC_aarch64-unknown-linux-gnu = None412 cargo:rerun-if-env-changed=CC_aarch64_unknown_linux_gnu413 CC_aarch64_unknown_linux_gnu = None414 cargo:rerun-if-env-changed=HOST_CC415 HOST_CC = Some(/nix/store/z2qkl46kv87zcs2sfwfjgc75nq0hbzhf-gcc-wrapper-15.3.0/bin/cc)416 cargo:rerun-if-env-changed=CC_ENABLE_DEBUG_OUTPUT417 cargo:rerun-if-env-changed=CRATE_CC_NO_DEFAULTS418 CRATE_CC_NO_DEFAULTS = None419 cargo:rerun-if-env-changed=CFLAGS420 CFLAGS = None421 cargo:rerun-if-env-changed=HOST_CFLAGS422 HOST_CFLAGS = None423 cargo:rerun-if-env-changed=CFLAGS_aarch64_unknown_linux_gnu424 CFLAGS_aarch64_unknown_linux_gnu = None425 cargo:rerun-if-env-changed=CFLAGS_aarch64-unknown-linux-gnu426 CFLAGS_aarch64-unknown-linux-gnu = None427 cargo:rerun-if-env-changed=CC_FORCE_DISABLE428 CC_FORCE_DISABLE = None429 cargo:rerun-if-env-changed=CC_aarch64-unknown-linux-gnu430 CC_aarch64-unknown-linux-gnu = None431 cargo:rerun-if-env-changed=CC_aarch64_unknown_linux_gnu432 CC_aarch64_unknown_linux_gnu = None433 cargo:rerun-if-env-changed=HOST_CC434 HOST_CC = Some(/nix/store/z2qkl46kv87zcs2sfwfjgc75nq0hbzhf-gcc-wrapper-15.3.0/bin/cc)435 cargo:rerun-if-env-changed=CRATE_CC_NO_DEFAULTS436 CRATE_CC_NO_DEFAULTS = None437 cargo:rerun-if-env-changed=CFLAGS438 CFLAGS = None439 cargo:rerun-if-env-changed=HOST_CFLAGS440 HOST_CFLAGS = None441 cargo:rerun-if-env-changed=CFLAGS_aarch64_unknown_linux_gnu442 CFLAGS_aarch64_unknown_linux_gnu = None443 cargo:rerun-if-env-changed=CFLAGS_aarch64-unknown-linux-gnu444 CFLAGS_aarch64-unknown-linux-gnu = None445 cargo:warning=Compilation of 'c11.c' succeeded - Ok(["/build/source/target/aarch64-unknown-linux-gnu/release/build/aws-lc-fips-sys-996b9b2f671df0c5/out/out-c11/7dfda64fdf5a526c-c11.o"]).446 cargo:rerun-if-env-changed=AWS_LC_FIPS_SYS_HOST_CC_aarch64_unknown_linux_gnu447 cargo:rerun-if-env-changed=AWS_LC_FIPS_SYS_HOST_CC448 cargo:warning=Environment Variable found 'AWS_LC_FIPS_SYS_HOST_CC': '/nix/store/7v2w6x6h13zzswz6agxxcrx73vqdd0px-clang-wrapper-21.1.8/bin/cc'449 cargo:rerun-if-env-changed=HOST_CC_aarch64_unknown_linux_gnu450 cargo:rerun-if-env-changed=HOST_CC451 cargo:warning=Environment Variable found 'HOST_CC': '/nix/store/z2qkl46kv87zcs2sfwfjgc75nq0hbzhf-gcc-wrapper-15.3.0/bin/cc'452 cargo:rerun-if-env-changed=AWS_LC_FIPS_SYS_CC_aarch64_unknown_linux_gnu453 cargo:rerun-if-env-changed=AWS_LC_FIPS_SYS_CC454 cargo:rerun-if-env-changed=CC_aarch64_unknown_linux_gnu455 cargo:rerun-if-env-changed=CC456 cargo:warning=Environment Variable found 'CC': 'clang'457 cargo:warning=Setting CC_aarch64_unknown_linux_gnu: /nix/store/7v2w6x6h13zzswz6agxxcrx73vqdd0px-clang-wrapper-21.1.8/bin/cc458 cargo:rerun-if-env-changed=AWS_LC_FIPS_SYS_HOST_CXX_aarch64_unknown_linux_gnu459 cargo:rerun-if-env-changed=AWS_LC_FIPS_SYS_HOST_CXX460 cargo:rerun-if-env-changed=HOST_CXX_aarch64_unknown_linux_gnu461 cargo:rerun-if-env-changed=HOST_CXX462 cargo:warning=Environment Variable found 'HOST_CXX': '/nix/store/z2qkl46kv87zcs2sfwfjgc75nq0hbzhf-gcc-wrapper-15.3.0/bin/c++'463 cargo:rerun-if-env-changed=AWS_LC_FIPS_SYS_CXX_aarch64_unknown_linux_gnu464 cargo:rerun-if-env-changed=AWS_LC_FIPS_SYS_CXX465 cargo:rerun-if-env-changed=CXX_aarch64_unknown_linux_gnu466 cargo:rerun-if-env-changed=CXX467 cargo:warning=Environment Variable found 'CXX': 'clang++'468 cargo:warning=Setting CXX_aarch64_unknown_linux_gnu: /nix/store/z2qkl46kv87zcs2sfwfjgc75nq0hbzhf-gcc-wrapper-15.3.0/bin/c++469 cargo:rerun-if-env-changed=CC_aarch64-unknown-linux-gnu470 CC_aarch64-unknown-linux-gnu = None471 cargo:rerun-if-env-changed=CC_aarch64_unknown_linux_gnu472 CC_aarch64_unknown_linux_gnu = Some(/nix/store/7v2w6x6h13zzswz6agxxcrx73vqdd0px-clang-wrapper-21.1.8/bin/cc)473 cargo:rerun-if-env-changed=CC_ENABLE_DEBUG_OUTPUT474 cargo:rerun-if-env-changed=CRATE_CC_NO_DEFAULTS475 CRATE_CC_NO_DEFAULTS = None476 cargo:rerun-if-env-changed=CFLAGS477 CFLAGS = None478 cargo:rerun-if-env-changed=HOST_CFLAGS479 HOST_CFLAGS = None480 cargo:rerun-if-env-changed=CFLAGS_aarch64_unknown_linux_gnu481 CFLAGS_aarch64_unknown_linux_gnu = None482 cargo:rerun-if-env-changed=CFLAGS_aarch64-unknown-linux-gnu483 CFLAGS_aarch64-unknown-linux-gnu = None484 cargo:warning=Using flag: -ffile-prefix-map="/build/authentik-rust-2026.8.3-vendor/source-registry-0/aws-lc-fips-sys-0.14.2"=485 cargo:rerun-if-env-changed=CC_aarch64-unknown-linux-gnu486 CC_aarch64-unknown-linux-gnu = None487 cargo:rerun-if-env-changed=CC_aarch64_unknown_linux_gnu488 CC_aarch64_unknown_linux_gnu = Some(/nix/store/7v2w6x6h13zzswz6agxxcrx73vqdd0px-clang-wrapper-21.1.8/bin/cc)489 cargo:rerun-if-env-changed=CC_ENABLE_DEBUG_OUTPUT490 cargo:rerun-if-env-changed=CRATE_CC_NO_DEFAULTS491 CRATE_CC_NO_DEFAULTS = None492 cargo:rerun-if-env-changed=CFLAGS493 CFLAGS = None494 cargo:rerun-if-env-changed=HOST_CFLAGS495 HOST_CFLAGS = None496 cargo:rerun-if-env-changed=CFLAGS_aarch64_unknown_linux_gnu497 CFLAGS_aarch64_unknown_linux_gnu = None498 cargo:rerun-if-env-changed=CFLAGS_aarch64-unknown-linux-gnu499 CFLAGS_aarch64-unknown-linux-gnu = None500 CMAKE_TOOLCHAIN_FILE_aarch64-unknown-linux-gnu = None501 CMAKE_TOOLCHAIN_FILE_aarch64_unknown_linux_gnu = None502 HOST_CMAKE_TOOLCHAIN_FILE = None503 CMAKE_TOOLCHAIN_FILE = None504 CMAKE_GENERATOR_aarch64-unknown-linux-gnu = None505 CMAKE_GENERATOR_aarch64_unknown_linux_gnu = None506 HOST_CMAKE_GENERATOR = None507 CMAKE_GENERATOR = None508 CMAKE_PREFIX_PATH_aarch64-unknown-linux-gnu = None509 CMAKE_PREFIX_PATH_aarch64_unknown_linux_gnu = None510 HOST_CMAKE_PREFIX_PATH = None511 CMAKE_PREFIX_PATH = None512 CMAKE_aarch64-unknown-linux-gnu = None513 CMAKE_aarch64_unknown_linux_gnu = None514 HOST_CMAKE = None515 CMAKE = Some("cmake")516 -- The C compiler identification is Clang 21.1.8517 -- Detecting C compiler ABI info518 -- Detecting C compiler ABI info - done519 -- Check for working C compiler: /nix/store/7v2w6x6h13zzswz6agxxcrx73vqdd0px-clang-wrapper-21.1.8/bin/cc - skipped520 -- Detecting C compile features521 -- Detecting C compile features - done522 -- COHABITANT_BINARIES: OFF523 -- Go compiler 1.26.7 found524 -- ENABLE_PRE_SONAME_BUILD: ON525 -- PERFORM_SONAME_BUILD: 0526 -- Entropy source configured: Dynamic (default: CPU Jitter)527 -- Entropy source configured: Dynamic (default: CPU Jitter)528 -- Found Perl: /nix/store/wlnxy8mxf0dgsk8qn14z0s6qs9j5idyp-perl-5.42.3/bin/perl (found version "5.42.3")529 -- Prefix build configured: performing build using prefix "aws_lc_fips_0_14_2_" and headers path "/build/authentik-rust-2026.8.3-vendor/source-registry-0/aws-lc-fips-sys-0.14.2/generated-include"530 -- Setting CMAKE_C_STANDARD=11531 -- Performing Test HAVE_C_FLAG__Wno_cast_function_type532 -- Performing Test HAVE_C_FLAG__Wno_cast_function_type - Success533 -- Compiler supports '-Wno-cast-function-type', adding to CMAKE_C_FLAGS534 -- Performing Test HAVE_C_FLAG__Wstring_concatenation535 -- Performing Test HAVE_C_FLAG__Wstring_concatenation - Success536 -- Compiler supports '-Wstring-concatenation', adding to C_CXX_FLAGS537 -- Performing Test HAVE_C_FLAG__Wimplicit_fallthrough538 -- Performing Test HAVE_C_FLAG__Wimplicit_fallthrough - Success539 -- Compiler supports '-Wimplicit-fallthrough', adding to C_CXX_FLAGS540 -- stdalign_check.c probe is positive, enabling AWS_LC_STDALIGN_AVAILABLE541 -- builtin_swap_check.c probe is positive, enabling AWS_LC_BUILTIN_SWAP_SUPPORTED542 -- linux_u32.c probe is positive, enabling AWS_LC_URANDOM_U32543 -- Performing Test HAVE_C_FLAG__Wshadow544 -- Performing Test HAVE_C_FLAG__Wshadow - Success545 -- Compiler supports '-Wshadow', adding to C_CXX_FLAGS546 -- The ASM compiler identification is Clang with GNU-like command-line547 -- Found assembler: /nix/store/7v2w6x6h13zzswz6agxxcrx73vqdd0px-clang-wrapper-21.1.8/bin/cc548 -- neon_sha3_check.c probe is positive, enabling MY_ASSEMBLER_SUPPORTS_NEON_SHA3_EXTENSION549 -- Generating compiler wrapper for: /nix/store/7v2w6x6h13zzswz6agxxcrx73vqdd0px-clang-wrapper-21.1.8/bin/cc550 -- Generated shell wrapper: /build/source/target/aarch64-unknown-linux-gnu/release/build/aws-lc-fips-sys-996b9b2f671df0c5/out/build/compiler_wrapper/compiler_wrapper.sh551 -- Generated batch wrapper: /build/source/target/aarch64-unknown-linux-gnu/release/build/aws-lc-fips-sys-996b9b2f671df0c5/out/build/compiler_wrapper/compiler_wrapper.bat552 -- Compiler wrapper ready: /build/source/target/aarch64-unknown-linux-gnu/release/build/aws-lc-fips-sys-996b9b2f671df0c5/out/build/compiler_wrapper/compiler_wrapper.sh553 -- Compiler wrapper launch command: /bin/sh;/build/source/target/aarch64-unknown-linux-gnu/release/build/aws-lc-fips-sys-996b9b2f671df0c5/out/build/compiler_wrapper/compiler_wrapper.sh554 -- Applied compiler wrapper to target: bcm_c_generated_asm555 -- Performing Test CMAKE_HAVE_LIBC_PTHREAD556 -- Performing Test CMAKE_HAVE_LIBC_PTHREAD - Success557 -- Found Threads: TRUE558 -- Configuring done (6.9s)559 -- Generating done (0.1s)560 -- Build files have been written to: /build/source/target/aarch64-unknown-linux-gnu/release/build/aws-lc-fips-sys-996b9b2f671df0c5/out/build561 [ 0%] Built target boringssl_prefix_symbols562 [ 1%] Building C object aws-lc/third_party/jitterentropy/CMakeFiles/jitterentropy.dir/jitterentropy-library/src/jitterentropy-base.c.o563 [ 1%] Building C object aws-lc/third_party/jitterentropy/CMakeFiles/jitterentropy.dir/jitterentropy-library/src/jitterentropy-gcd.c.o564 [ 1%] Building C object aws-lc/third_party/jitterentropy/CMakeFiles/jitterentropy.dir/jitterentropy-library/src/jitterentropy-health.c.o565 [ 2%] Building C object aws-lc/third_party/jitterentropy/CMakeFiles/jitterentropy.dir/jitterentropy-library/src/jitterentropy-noise.c.o566 [ 2%] Building C object aws-lc/third_party/jitterentropy/CMakeFiles/jitterentropy.dir/jitterentropy-library/src/jitterentropy-sha3.c.o567 [ 3%] Building C object aws-lc/third_party/jitterentropy/CMakeFiles/jitterentropy.dir/jitterentropy-library/src/jitterentropy-timer.c.o568 [ 3%] Built target jitterentropy569 [ 3%] Generating test/trampoline-armv8.S570 [ 3%] Generating chacha/chacha-armv8.S571 [ 4%] Generating cipher_extra/chacha20_poly1305_armv8.S572 [ 5%] Generating err_data.c573 [ 5%] Building C object aws-lc/crypto/CMakeFiles/crypto_objects.dir/asn1/a_bitstr.c.o574 [ 5%] Building C object aws-lc/crypto/CMakeFiles/crypto_objects.dir/asn1/a_bool.c.o575 [ 6%] Building C object aws-lc/crypto/CMakeFiles/crypto_objects.dir/asn1/a_d2i_fp.c.o576 [ 6%] Building C object aws-lc/crypto/CMakeFiles/crypto_objects.dir/asn1/a_dup.c.o577 [ 6%] Building C object aws-lc/crypto/CMakeFiles/crypto_objects.dir/asn1/a_gentm.c.o578 [ 7%] Building C object aws-lc/crypto/CMakeFiles/crypto_objects.dir/asn1/a_i2d_fp.c.o579 [ 7%] Building C object aws-lc/crypto/CMakeFiles/crypto_objects.dir/asn1/a_int.c.o580 [ 7%] Building C object aws-lc/crypto/CMakeFiles/crypto_objects.dir/asn1/a_mbstr.c.o581 [ 8%] Building C object aws-lc/crypto/CMakeFiles/crypto_objects.dir/asn1/a_object.c.o582 [ 8%] Building C object aws-lc/crypto/CMakeFiles/crypto_objects.dir/asn1/a_octet.c.o583 [ 8%] Building C object aws-lc/crypto/CMakeFiles/crypto_objects.dir/asn1/a_strex.c.o584 [ 9%] Building C object aws-lc/crypto/CMakeFiles/crypto_objects.dir/asn1/a_strnid.c.o585 [ 9%] Building C object aws-lc/crypto/CMakeFiles/crypto_objects.dir/asn1/a_time.c.o586 [ 9%] Building C object aws-lc/crypto/CMakeFiles/crypto_objects.dir/asn1/a_type.c.o587 [ 10%] Building C object aws-lc/crypto/CMakeFiles/crypto_objects.dir/asn1/a_utctm.c.o588 [ 10%] Building C object aws-lc/crypto/CMakeFiles/crypto_objects.dir/asn1/a_utf8.c.o589 [ 10%] Building C object aws-lc/crypto/CMakeFiles/crypto_objects.dir/asn1/asn1_lib.c.o590 [ 11%] Building C object aws-lc/crypto/CMakeFiles/crypto_objects.dir/asn1/asn1_par.c.o591 [ 11%] Building C object aws-lc/crypto/CMakeFiles/crypto_objects.dir/asn1/asn_pack.c.o592 [ 12%] Building C object aws-lc/crypto/CMakeFiles/crypto_objects.dir/asn1/f_int.c.o593 [ 12%] Building C object aws-lc/crypto/CMakeFiles/crypto_objects.dir/asn1/f_string.c.o594 [ 12%] Building C object aws-lc/crypto/CMakeFiles/crypto_objects.dir/asn1/tasn_dec.c.o595 [ 13%] Building C object aws-lc/crypto/CMakeFiles/crypto_objects.dir/asn1/tasn_enc.c.o596 [ 13%] Building C object aws-lc/crypto/CMakeFiles/crypto_objects.dir/asn1/tasn_fre.c.o597 [ 13%] Building C object aws-lc/crypto/CMakeFiles/crypto_objects.dir/asn1/tasn_new.c.o598 [ 14%] Building C object aws-lc/crypto/CMakeFiles/crypto_objects.dir/asn1/tasn_typ.c.o599 [ 14%] Building C object aws-lc/crypto/CMakeFiles/crypto_objects.dir/asn1/tasn_utl.c.o600 [ 14%] Building C object aws-lc/crypto/CMakeFiles/crypto_objects.dir/asn1/posix_time.c.o601 [ 15%] Building C object aws-lc/crypto/CMakeFiles/crypto_objects.dir/base64/base64.c.o602 [ 15%] Building C object aws-lc/crypto/CMakeFiles/crypto_objects.dir/bio/bio.c.o603 [ 15%] Building C object aws-lc/crypto/CMakeFiles/crypto_objects.dir/bio/bio_addr.c.o604 [ 16%] Building C object aws-lc/crypto/CMakeFiles/crypto_objects.dir/bio/bio_mem.c.o605 [ 16%] Building C object aws-lc/crypto/CMakeFiles/crypto_objects.dir/bio/connect.c.o606 [ 16%] Building C object aws-lc/crypto/CMakeFiles/crypto_objects.dir/bio/dgram.c.o607 [ 17%] Building C object aws-lc/crypto/CMakeFiles/crypto_objects.dir/bio/errno.c.o608 [ 17%] Building C object aws-lc/crypto/CMakeFiles/crypto_objects.dir/bio/fd.c.o609 [ 17%] Building C object aws-lc/crypto/CMakeFiles/crypto_objects.dir/bio/file.c.o610 [ 18%] Building C object aws-lc/crypto/CMakeFiles/crypto_objects.dir/bio/hexdump.c.o611 [ 18%] Building C object aws-lc/crypto/CMakeFiles/crypto_objects.dir/bio/md.c.o612 [ 18%] Building C object aws-lc/crypto/CMakeFiles/crypto_objects.dir/bio/pair.c.o613 [ 19%] Building C object aws-lc/crypto/CMakeFiles/crypto_objects.dir/bio/printf.c.o614 [ 19%] Building C object aws-lc/crypto/CMakeFiles/crypto_objects.dir/bio/socket.c.o615 [ 20%] Building C object aws-lc/crypto/CMakeFiles/crypto_objects.dir/bio/socket_helper.c.o616 [ 20%] Building C object aws-lc/crypto/CMakeFiles/crypto_objects.dir/blake2/blake2.c.o617 [ 20%] Building C object aws-lc/crypto/CMakeFiles/crypto_objects.dir/bn_extra/bn_asn1.c.o618 [ 21%] Building C object aws-lc/crypto/CMakeFiles/crypto_objects.dir/bn_extra/convert.c.o619 [ 21%] Building C object aws-lc/crypto/CMakeFiles/crypto_objects.dir/buf/buf.c.o620 [ 21%] Building C object aws-lc/crypto/CMakeFiles/crypto_objects.dir/bytestring/asn1_compat.c.o621 [ 22%] Building C object aws-lc/crypto/CMakeFiles/crypto_objects.dir/bytestring/ber.c.o622 [ 22%] Building C object aws-lc/crypto/CMakeFiles/crypto_objects.dir/bytestring/cbb.c.o623 [ 22%] Building C object aws-lc/crypto/CMakeFiles/crypto_objects.dir/bytestring/cbs.c.o624 [ 23%] Building C object aws-lc/crypto/CMakeFiles/crypto_objects.dir/bytestring/unicode.c.o625 [ 23%] Building C object aws-lc/crypto/CMakeFiles/crypto_objects.dir/chacha/chacha.c.o626 [ 23%] Building C object aws-lc/crypto/CMakeFiles/crypto_objects.dir/cipher_extra/cipher_extra.c.o627 [ 24%] Building C object aws-lc/crypto/CMakeFiles/crypto_objects.dir/cipher_extra/derive_key.c.o628 [ 24%] Building C object aws-lc/crypto/CMakeFiles/crypto_objects.dir/cipher_extra/e_aesctrhmac.c.o629 [ 24%] Building C object aws-lc/crypto/CMakeFiles/crypto_objects.dir/cipher_extra/e_aesgcmsiv.c.o630 [ 25%] Building C object aws-lc/crypto/CMakeFiles/crypto_objects.dir/cipher_extra/e_chacha20poly1305.c.o631 [ 25%] Building C object aws-lc/crypto/CMakeFiles/crypto_objects.dir/cipher_extra/e_aes_cbc_hmac_sha1.c.o632 [ 25%] Building C object aws-lc/crypto/CMakeFiles/crypto_objects.dir/cipher_extra/e_aes_cbc_hmac_sha256.c.o633 [ 26%] Building C object aws-lc/crypto/CMakeFiles/crypto_objects.dir/cipher_extra/e_des.c.o634 [ 26%] Building C object aws-lc/crypto/CMakeFiles/crypto_objects.dir/cipher_extra/e_null.c.o635 [ 26%] Building C object aws-lc/crypto/CMakeFiles/crypto_objects.dir/cipher_extra/e_rc2.c.o636 [ 27%] Building C object aws-lc/crypto/CMakeFiles/crypto_objects.dir/cipher_extra/e_rc4.c.o637 [ 27%] Building C object aws-lc/crypto/CMakeFiles/crypto_objects.dir/cipher_extra/e_tls.c.o638 [ 27%] Building C object aws-lc/crypto/CMakeFiles/crypto_objects.dir/cipher_extra/tls_cbc.c.o639 [ 28%] Building C object aws-lc/crypto/CMakeFiles/crypto_objects.dir/conf/conf.c.o640 [ 28%] Building C object aws-lc/crypto/CMakeFiles/crypto_objects.dir/console/console.c.o641 [ 29%] Building C object aws-lc/crypto/CMakeFiles/crypto_objects.dir/crypto.c.o642 [ 29%] Building C object aws-lc/crypto/CMakeFiles/crypto_objects.dir/des/des.c.o643 [ 29%] Building C object aws-lc/crypto/CMakeFiles/crypto_objects.dir/dh_extra/params.c.o644 [ 30%] Building C object aws-lc/crypto/CMakeFiles/crypto_objects.dir/dh_extra/dh_asn1.c.o645 [ 30%] Building C object aws-lc/crypto/CMakeFiles/crypto_objects.dir/digest_extra/digest_extra.c.o646 [ 30%] Building C object aws-lc/crypto/CMakeFiles/crypto_objects.dir/dsa/dsa.c.o647 [ 31%] Building C object aws-lc/crypto/CMakeFiles/crypto_objects.dir/dsa/dsa_asn1.c.o648 [ 31%] Building C object aws-lc/crypto/CMakeFiles/crypto_objects.dir/ecdh_extra/ecdh_extra.c.o649 [ 31%] Building C object aws-lc/crypto/CMakeFiles/crypto_objects.dir/ecdsa_extra/ecdsa_asn1.c.o650 [ 32%] Building C object aws-lc/crypto/CMakeFiles/crypto_objects.dir/ec_extra/ec_asn1.c.o651 [ 32%] Building C object aws-lc/crypto/CMakeFiles/crypto_objects.dir/ec_extra/ec_derive.c.o652 [ 32%] Building C object aws-lc/crypto/CMakeFiles/crypto_objects.dir/ec_extra/hash_to_curve.c.o653 [ 33%] Building C object aws-lc/crypto/CMakeFiles/crypto_objects.dir/err/err.c.o654 [ 33%] Building C object aws-lc/crypto/CMakeFiles/crypto_objects.dir/err_data.c.o655 [ 33%] Building C object aws-lc/crypto/CMakeFiles/crypto_objects.dir/engine/engine.c.o656 [ 34%] Building C object aws-lc/crypto/CMakeFiles/crypto_objects.dir/evp_extra/evp_asn1.c.o657 [ 34%] Building C object aws-lc/crypto/CMakeFiles/crypto_objects.dir/evp_extra/p_dh.c.o658 [ 34%] Building C object aws-lc/crypto/CMakeFiles/crypto_objects.dir/evp_extra/p_dh_asn1.c.o659 [ 35%] Building C object aws-lc/crypto/CMakeFiles/crypto_objects.dir/evp_extra/p_dsa.c.o660 [ 35%] Building C object aws-lc/crypto/CMakeFiles/crypto_objects.dir/evp_extra/p_dsa_asn1.c.o661 [ 35%] Building C object aws-lc/crypto/CMakeFiles/crypto_objects.dir/evp_extra/p_ec_asn1.c.o662 [ 36%] Building C object aws-lc/crypto/CMakeFiles/crypto_objects.dir/evp_extra/p_ed25519_asn1.c.o663 [ 36%] Building C object aws-lc/crypto/CMakeFiles/crypto_objects.dir/evp_extra/p_hmac_asn1.c.o664 [ 37%] Building C object aws-lc/crypto/CMakeFiles/crypto_objects.dir/evp_extra/p_kem_asn1.c.o665 [ 37%] Building C object aws-lc/crypto/CMakeFiles/crypto_objects.dir/evp_extra/p_pqdsa_asn1.c.o666 [ 37%] Building C object aws-lc/crypto/CMakeFiles/crypto_objects.dir/evp_extra/p_rsa_asn1.c.o667 [ 38%] Building C object aws-lc/crypto/CMakeFiles/crypto_objects.dir/evp_extra/p_x25519.c.o668 [ 38%] Building C object aws-lc/crypto/CMakeFiles/crypto_objects.dir/evp_extra/p_x25519_asn1.c.o669 [ 38%] Building C object aws-lc/crypto/CMakeFiles/crypto_objects.dir/evp_extra/p_methods.c.o670 [ 39%] Building C object aws-lc/crypto/CMakeFiles/crypto_objects.dir/evp_extra/print.c.o671 [ 39%] Building C object aws-lc/crypto/CMakeFiles/crypto_objects.dir/evp_extra/scrypt.c.o672 [ 39%] Building C object aws-lc/crypto/CMakeFiles/crypto_objects.dir/evp_extra/sign.c.o673 [ 40%] Building C object aws-lc/crypto/CMakeFiles/crypto_objects.dir/ex_data.c.o674 [ 40%] Building C object aws-lc/crypto/CMakeFiles/crypto_objects.dir/hpke/hpke.c.o675 [ 40%] Building C object aws-lc/crypto/CMakeFiles/crypto_objects.dir/hrss/hrss.c.o676 [ 41%] Building C object aws-lc/crypto/CMakeFiles/crypto_objects.dir/kyber/kyber512r3_ref.c.o677 [ 41%] Building C object aws-lc/crypto/CMakeFiles/crypto_objects.dir/kyber/kyber768r3_ref.c.o678 [ 41%] Building C object aws-lc/crypto/CMakeFiles/crypto_objects.dir/kyber/kyber1024r3_ref.c.o679 [ 42%] Building C object aws-lc/crypto/CMakeFiles/crypto_objects.dir/kyber/pqcrystals_kyber_ref_common/fips202.c.o680 [ 42%] Building C object aws-lc/crypto/CMakeFiles/crypto_objects.dir/kyber/kem_kyber.c.o681 [ 42%] Building C object aws-lc/crypto/CMakeFiles/crypto_objects.dir/lhash/lhash.c.o682 [ 43%] Building C object aws-lc/crypto/CMakeFiles/crypto_objects.dir/mem.c.o683 [ 43%] Building C object aws-lc/crypto/CMakeFiles/crypto_objects.dir/obj/obj.c.o684 [ 43%] Building C object aws-lc/crypto/CMakeFiles/crypto_objects.dir/obj/obj_xref.c.o685 [ 44%] Building C object aws-lc/crypto/CMakeFiles/crypto_objects.dir/ocsp/ocsp_asn.c.o686 [ 44%] Building C object aws-lc/crypto/CMakeFiles/crypto_objects.dir/ocsp/ocsp_client.c.o687 [ 45%] Building C object aws-lc/crypto/CMakeFiles/crypto_objects.dir/ocsp/ocsp_extension.c.o688 [ 45%] Building C object aws-lc/crypto/CMakeFiles/crypto_objects.dir/ocsp/ocsp_http.c.o689 [ 45%] Building C object aws-lc/crypto/CMakeFiles/crypto_objects.dir/ocsp/ocsp_lib.c.o690 [ 46%] Building C object aws-lc/crypto/CMakeFiles/crypto_objects.dir/ocsp/ocsp_print.c.o691 [ 46%] Building C object aws-lc/crypto/CMakeFiles/crypto_objects.dir/ocsp/ocsp_server.c.o692 [ 46%] Building C object aws-lc/crypto/CMakeFiles/crypto_objects.dir/ocsp/ocsp_verify.c.o693 [ 47%] Building C object aws-lc/crypto/CMakeFiles/crypto_objects.dir/pem/pem_all.c.o694 [ 47%] Building C object aws-lc/crypto/CMakeFiles/crypto_objects.dir/pem/pem_info.c.o695 [ 47%] Building C object aws-lc/crypto/CMakeFiles/crypto_objects.dir/pem/pem_lib.c.o696 [ 48%] Building C object aws-lc/crypto/CMakeFiles/crypto_objects.dir/pem/pem_oth.c.o697 [ 48%] Building C object aws-lc/crypto/CMakeFiles/crypto_objects.dir/pem/pem_pk8.c.o698 [ 48%] Building C object aws-lc/crypto/CMakeFiles/crypto_objects.dir/pem/pem_pkey.c.o699 [ 49%] Building C object aws-lc/crypto/CMakeFiles/crypto_objects.dir/pem/pem_x509.c.o700 [ 49%] Building C object aws-lc/crypto/CMakeFiles/crypto_objects.dir/pem/pem_xaux.c.o701 [ 49%] Building C object aws-lc/crypto/CMakeFiles/crypto_objects.dir/pkcs7/bio/cipher.c.o702 [ 50%] Building C object aws-lc/crypto/CMakeFiles/crypto_objects.dir/pkcs7/pkcs7.c.o703 [ 50%] Building C object aws-lc/crypto/CMakeFiles/crypto_objects.dir/pkcs7/pkcs7_asn1.c.o704 [ 50%] Building C object aws-lc/crypto/CMakeFiles/crypto_objects.dir/pkcs7/pkcs7_x509.c.o705 [ 51%] Building C object aws-lc/crypto/CMakeFiles/crypto_objects.dir/pkcs8/pkcs8.c.o706 [ 51%] Building C object aws-lc/crypto/CMakeFiles/crypto_objects.dir/pkcs8/pkcs8_x509.c.o707 [ 51%] Building C object aws-lc/crypto/CMakeFiles/crypto_objects.dir/pkcs8/p5_pbev2.c.o708 [ 52%] Building C object aws-lc/crypto/CMakeFiles/crypto_objects.dir/poly1305/poly1305.c.o709 [ 52%] Building C object aws-lc/crypto/CMakeFiles/crypto_objects.dir/poly1305/poly1305_arm.c.o710 [ 52%] Building C object aws-lc/crypto/CMakeFiles/crypto_objects.dir/poly1305/poly1305_vec.c.o711 [ 53%] Building C object aws-lc/crypto/CMakeFiles/crypto_objects.dir/pool/pool.c.o712 [ 53%] Building C object aws-lc/crypto/CMakeFiles/crypto_objects.dir/rand_extra/ccrandomgeneratebytes.c.o713 [ 54%] Building C object aws-lc/crypto/CMakeFiles/crypto_objects.dir/rand_extra/deterministic.c.o714 [ 54%] Building C object aws-lc/crypto/CMakeFiles/crypto_objects.dir/rand_extra/getentropy.c.o715 [ 54%] Building C object aws-lc/crypto/CMakeFiles/crypto_objects.dir/rand_extra/rand_extra.c.o716 [ 55%] Building C object aws-lc/crypto/CMakeFiles/crypto_objects.dir/rand_extra/snapsafe_fallback.c.o717 [ 55%] Building C object aws-lc/crypto/CMakeFiles/crypto_objects.dir/rand_extra/urandom.c.o718 [ 55%] Building C object aws-lc/crypto/CMakeFiles/crypto_objects.dir/rand_extra/windows.c.o719 [ 56%] Building C object aws-lc/crypto/CMakeFiles/crypto_objects.dir/rc4/rc4.c.o720 [ 56%] Building C object aws-lc/crypto/CMakeFiles/crypto_objects.dir/refcount_c11.c.o721 [ 56%] Building C object aws-lc/crypto/CMakeFiles/crypto_objects.dir/refcount_lock.c.o722 [ 57%] Building C object aws-lc/crypto/CMakeFiles/crypto_objects.dir/refcount_win.c.o723 [ 57%] Building C object aws-lc/crypto/CMakeFiles/crypto_objects.dir/rsa_extra/rsa_asn1.c.o724 [ 57%] Building C object aws-lc/crypto/CMakeFiles/crypto_objects.dir/rsa_extra/rsassa_pss_asn1.c.o725 [ 58%] Building C object aws-lc/crypto/CMakeFiles/crypto_objects.dir/rsa_extra/rsa_crypt.c.o726 [ 58%] Building C object aws-lc/crypto/CMakeFiles/crypto_objects.dir/rsa_extra/rsa_print.c.o727 [ 58%] Building C object aws-lc/crypto/CMakeFiles/crypto_objects.dir/stack/stack.c.o728 [ 59%] Building C object aws-lc/crypto/CMakeFiles/crypto_objects.dir/siphash/siphash.c.o729 [ 59%] Building C object aws-lc/crypto/CMakeFiles/crypto_objects.dir/spake25519/spake25519.c.o730 [ 59%] Building C object aws-lc/crypto/CMakeFiles/crypto_objects.dir/thread.c.o731 [ 60%] Building C object aws-lc/crypto/CMakeFiles/crypto_objects.dir/thread_none.c.o732 [ 60%] Building C object aws-lc/crypto/CMakeFiles/crypto_objects.dir/thread_pthread.c.o733 [ 60%] Building C object aws-lc/crypto/CMakeFiles/crypto_objects.dir/thread_win.c.o734 [ 61%] Building C object aws-lc/crypto/CMakeFiles/crypto_objects.dir/trust_token/pmbtoken.c.o735 [ 61%] Building C object aws-lc/crypto/CMakeFiles/crypto_objects.dir/trust_token/trust_token.c.o736 [ 62%] Building C object aws-lc/crypto/CMakeFiles/crypto_objects.dir/trust_token/voprf.c.o737 [ 62%] Building C object aws-lc/crypto/CMakeFiles/crypto_objects.dir/ube/ube.c.o738 [ 62%] Building C object aws-lc/crypto/CMakeFiles/crypto_objects.dir/ube/fork_detect.c.o739 [ 63%] Building C object aws-lc/crypto/CMakeFiles/crypto_objects.dir/ube/snapsafe_detect.c.o740 [ 63%] Building C object aws-lc/crypto/CMakeFiles/crypto_objects.dir/x509/a_digest.c.o741 [ 63%] Building C object aws-lc/crypto/CMakeFiles/crypto_objects.dir/x509/a_sign.c.o742 [ 64%] Building C object aws-lc/crypto/CMakeFiles/crypto_objects.dir/x509/a_verify.c.o743 [ 64%] Building C object aws-lc/crypto/CMakeFiles/crypto_objects.dir/x509/algorithm.c.o744 [ 64%] Building C object aws-lc/crypto/CMakeFiles/crypto_objects.dir/x509/asn1_gen.c.o745 [ 65%] Building C object aws-lc/crypto/CMakeFiles/crypto_objects.dir/x509/by_dir.c.o746 [ 65%] Building C object aws-lc/crypto/CMakeFiles/crypto_objects.dir/x509/by_file.c.o747 [ 65%] Building C object aws-lc/crypto/CMakeFiles/crypto_objects.dir/x509/i2d_pr.c.o748 [ 66%] Building C object aws-lc/crypto/CMakeFiles/crypto_objects.dir/x509/name_print.c.o749 [ 66%] Building C object aws-lc/crypto/CMakeFiles/crypto_objects.dir/x509/policy.c.o750 [ 66%] Building C object aws-lc/crypto/CMakeFiles/crypto_objects.dir/x509/rsa_pss.c.o751 [ 67%] Building C object aws-lc/crypto/CMakeFiles/crypto_objects.dir/x509/t_crl.c.o752 [ 67%] Building C object aws-lc/crypto/CMakeFiles/crypto_objects.dir/x509/t_req.c.o753 [ 67%] Building C object aws-lc/crypto/CMakeFiles/crypto_objects.dir/x509/t_x509.c.o754 [ 68%] Building C object aws-lc/crypto/CMakeFiles/crypto_objects.dir/x509/t_x509a.c.o755 [ 68%] Building C object aws-lc/crypto/CMakeFiles/crypto_objects.dir/x509/v3_akey.c.o756 [ 68%] Building C object aws-lc/crypto/CMakeFiles/crypto_objects.dir/x509/v3_akeya.c.o757 [ 69%] Building C object aws-lc/crypto/CMakeFiles/crypto_objects.dir/x509/v3_alt.c.o758 [ 69%] Building C object aws-lc/crypto/CMakeFiles/crypto_objects.dir/x509/v3_bcons.c.o759 [ 70%] Building C object aws-lc/crypto/CMakeFiles/crypto_objects.dir/x509/v3_bitst.c.o760 [ 70%] Building C object aws-lc/crypto/CMakeFiles/crypto_objects.dir/x509/v3_conf.c.o761 [ 70%] Building C object aws-lc/crypto/CMakeFiles/crypto_objects.dir/x509/v3_cpols.c.o762 [ 71%] Building C object aws-lc/crypto/CMakeFiles/crypto_objects.dir/x509/v3_crld.c.o763 [ 71%] Building C object aws-lc/crypto/CMakeFiles/crypto_objects.dir/x509/v3_enum.c.o764 [ 71%] Building C object aws-lc/crypto/CMakeFiles/crypto_objects.dir/x509/v3_extku.c.o765 [ 72%] Building C object aws-lc/crypto/CMakeFiles/crypto_objects.dir/x509/v3_genn.c.o766 [ 72%] Building C object aws-lc/crypto/CMakeFiles/crypto_objects.dir/x509/v3_ia5.c.o767 [ 72%] Building C object aws-lc/crypto/CMakeFiles/crypto_objects.dir/x509/v3_info.c.o768 [ 73%] Building C object aws-lc/crypto/CMakeFiles/crypto_objects.dir/x509/v3_int.c.o769 [ 73%] Building C object aws-lc/crypto/CMakeFiles/crypto_objects.dir/x509/v3_lib.c.o770 [ 73%] Building C object aws-lc/crypto/CMakeFiles/crypto_objects.dir/x509/v3_ncons.c.o771 [ 74%] Building C object aws-lc/crypto/CMakeFiles/crypto_objects.dir/x509/v3_ocsp.c.o772 [ 74%] Building C object aws-lc/crypto/CMakeFiles/crypto_objects.dir/x509/v3_pcons.c.o773 [ 74%] Building C object aws-lc/crypto/CMakeFiles/crypto_objects.dir/x509/v3_pmaps.c.o774 [ 75%] Building C object aws-lc/crypto/CMakeFiles/crypto_objects.dir/x509/v3_prn.c.o775 [ 75%] Building C object aws-lc/crypto/CMakeFiles/crypto_objects.dir/x509/v3_purp.c.o776 [ 75%] Building C object aws-lc/crypto/CMakeFiles/crypto_objects.dir/x509/v3_skey.c.o777 [ 76%] Building C object aws-lc/crypto/CMakeFiles/crypto_objects.dir/x509/v3_utl.c.o778 [ 76%] Building C object aws-lc/crypto/CMakeFiles/crypto_objects.dir/x509/x_algor.c.o779 [ 76%] Building C object aws-lc/crypto/CMakeFiles/crypto_objects.dir/x509/x_all.c.o780 [ 77%] Building C object aws-lc/crypto/CMakeFiles/crypto_objects.dir/x509/x_attrib.c.o781 [ 77%] Building C object aws-lc/crypto/CMakeFiles/crypto_objects.dir/x509/x_crl.c.o782 [ 77%] Building C object aws-lc/crypto/CMakeFiles/crypto_objects.dir/x509/x_exten.c.o783 [ 78%] Building C object aws-lc/crypto/CMakeFiles/crypto_objects.dir/x509/x_name.c.o784 [ 78%] Building C object aws-lc/crypto/CMakeFiles/crypto_objects.dir/x509/x_pubkey.c.o785 [ 79%] Building C object aws-lc/crypto/CMakeFiles/crypto_objects.dir/x509/x_req.c.o786 [ 79%] Building C object aws-lc/crypto/CMakeFiles/crypto_objects.dir/x509/x_sig.c.o787 [ 79%] Building C object aws-lc/crypto/CMakeFiles/crypto_objects.dir/x509/x_spki.c.o788 [ 80%] Building C object aws-lc/crypto/CMakeFiles/crypto_objects.dir/x509/x_val.c.o789 [ 80%] Building C object aws-lc/crypto/CMakeFiles/crypto_objects.dir/x509/x_x509.c.o790 [ 80%] Building C object aws-lc/crypto/CMakeFiles/crypto_objects.dir/x509/x_x509a.c.o791 [ 81%] Building C object aws-lc/crypto/CMakeFiles/crypto_objects.dir/x509/x509_att.c.o792 [ 81%] Building C object aws-lc/crypto/CMakeFiles/crypto_objects.dir/x509/x509_cmp.c.o793 [ 81%] Building C object aws-lc/crypto/CMakeFiles/crypto_objects.dir/x509/x509_d2.c.o794 [ 82%] Building C object aws-lc/crypto/CMakeFiles/crypto_objects.dir/x509/x509_def.c.o795 [ 82%] Building C object aws-lc/crypto/CMakeFiles/crypto_objects.dir/x509/x509_ext.c.o796 [ 82%] Building C object aws-lc/crypto/CMakeFiles/crypto_objects.dir/x509/x509_lu.c.o797 [ 83%] Building C object aws-lc/crypto/CMakeFiles/crypto_objects.dir/x509/x509_obj.c.o798 [ 83%] Building C object aws-lc/crypto/CMakeFiles/crypto_objects.dir/x509/x509_req.c.o799 [ 83%] Building C object aws-lc/crypto/CMakeFiles/crypto_objects.dir/x509/x509_set.c.o800 [ 84%] Building C object aws-lc/crypto/CMakeFiles/crypto_objects.dir/x509/x509_trs.c.o801 [ 84%] Building C object aws-lc/crypto/CMakeFiles/crypto_objects.dir/x509/x509_txt.c.o802 [ 84%] Building C object aws-lc/crypto/CMakeFiles/crypto_objects.dir/x509/x509_v3.c.o803 [ 85%] Building C object aws-lc/crypto/CMakeFiles/crypto_objects.dir/x509/x509_vfy.c.o804 [ 85%] Building C object aws-lc/crypto/CMakeFiles/crypto_objects.dir/x509/x509_vpm.c.o805 [ 85%] Building C object aws-lc/crypto/CMakeFiles/crypto_objects.dir/x509/x509.c.o806 [ 86%] Building C object aws-lc/crypto/CMakeFiles/crypto_objects.dir/x509/x509cset.c.o807 [ 86%] Building C object aws-lc/crypto/CMakeFiles/crypto_objects.dir/x509/x509name.c.o808 [ 87%] Building C object aws-lc/crypto/CMakeFiles/crypto_objects.dir/x509/x509rset.c.o809 [ 87%] Building C object aws-lc/crypto/CMakeFiles/crypto_objects.dir/x509/x509spki.c.o810 [ 87%] Building C object aws-lc/crypto/CMakeFiles/crypto_objects.dir/decrepit/bio/base64_bio.c.o811 [ 88%] Building C object aws-lc/crypto/CMakeFiles/crypto_objects.dir/decrepit/blowfish/blowfish.c.o812 [ 88%] Building C object aws-lc/crypto/CMakeFiles/crypto_objects.dir/decrepit/cast/cast.c.o813 [ 88%] Building C object aws-lc/crypto/CMakeFiles/crypto_objects.dir/decrepit/cast/cast_tables.c.o814 [ 89%] Building C object aws-lc/crypto/CMakeFiles/crypto_objects.dir/decrepit/cfb/cfb.c.o815 [ 89%] Building C object aws-lc/crypto/CMakeFiles/crypto_objects.dir/decrepit/dh/dh_decrepit.c.o816 [ 89%] Building C object aws-lc/crypto/CMakeFiles/crypto_objects.dir/decrepit/evp/evp_do_all.c.o817 [ 90%] Building C object aws-lc/crypto/CMakeFiles/crypto_objects.dir/decrepit/obj/obj_decrepit.c.o818 [ 90%] Building C object aws-lc/crypto/CMakeFiles/crypto_objects.dir/decrepit/ripemd/ripemd.c.o819 [ 90%] Building C object aws-lc/crypto/CMakeFiles/crypto_objects.dir/decrepit/rsa/rsa_decrepit.c.o820 [ 91%] Building C object aws-lc/crypto/CMakeFiles/crypto_objects.dir/decrepit/x509/x509_decrepit.c.o821 [ 91%] Building ASM object aws-lc/crypto/CMakeFiles/crypto_objects.dir/chacha/chacha-armv8.S.o822 [ 91%] Building ASM object aws-lc/crypto/CMakeFiles/crypto_objects.dir/test/trampoline-armv8.S.o823 [ 92%] Building ASM object aws-lc/crypto/CMakeFiles/crypto_objects.dir/cipher_extra/chacha20_poly1305_armv8.S.o824 [ 92%] Built target crypto_objects825 [ 92%] Building C object aws-lc/crypto/fipsmodule/CMakeFiles/fipsmodule.dir/fips_shared_support.c.o826 [ 92%] Building C object aws-lc/crypto/fipsmodule/CMakeFiles/fipsmodule.dir/cpucap/cpucap.c.o827 [ 92%] Built target fipsmodule828 [ 92%] Building C object aws-lc/crypto/fipsmodule/CMakeFiles/bcm_c_generated_asm.dir/bcm.c.o829 [ 92%] Linking C static library libbcm_c_generated_asm.a830 [ 92%] Built target bcm_c_generated_asm831 [ 92%] Generating vpaes-armv8.S832 [ 92%] Generating aesv8-armx.S833 [ 92%] Generating aesv8-gcm-armv8-unroll8.S834 [ 93%] Generating aesv8-gcm-armv8.S835 [ 93%] Generating armv8-mont.S836 [ 94%] Generating delocate837 [ 94%] Generating bn-armv8.S838 [ 94%] Generating ghash-neon-armv8.S839 [ 94%] Generating ghashv8-armx.S840 [ 95%] Generating keccak1600-armv8.S841 [ 95%] Generating md5-armv8.S842 [ 95%] Generating p256-armv8-asm.S843 [ 96%] Generating p256_beeu-armv8-asm.S844 [ 96%] Generating rndr-armv8.S845 [ 96%] Generating sha1-armv8.S846 [ 97%] Generating sha256-armv8.S847 [ 97%] Generating sha512-armv8.S848 [ 98%] Generating bcm-delocated.S849 [ 99%] Building ASM object aws-lc/crypto/fipsmodule/CMakeFiles/bcm_hashunset.dir/bcm-delocated.S.o850851 --- stderr852 running: cd "/build/source/target/aarch64-unknown-linux-gnu/release/build/aws-lc-fips-sys-996b9b2f671df0c5/out/build" && CMAKE_PREFIX_PATH="" LC_ALL="C" "cmake" "/build/authentik-rust-2026.8.3-vendor/source-registry-0/aws-lc-fips-sys-0.14.2" "-B" "/build/source/target/aarch64-unknown-linux-gnu/release/build/aws-lc-fips-sys-996b9b2f671df0c5/out/build" "-DBUILD_SHARED_LIBS=0" "-DBORINGSSL_PREFIX=aws_lc_fips_0_14_2_" "-DBORINGSSL_PREFIX_HEADERS=/build/authentik-rust-2026.8.3-vendor/source-registry-0/aws-lc-fips-sys-0.14.2/generated-include" "-DBUILD_TESTING=OFF" "-DBUILD_TOOL=OFF" "-DENABLE_SOURCE_MODIFICATION=OFF" "-DBUILD_LIBSSL=OFF" "-DFIPS=1" "-DOPENSSL_SMALL=OFF" "-DMY_ASSEMBLER_IS_TOO_OLD_FOR_512AVX=OFF" "-DCMAKE_C_STANDARD=11" "-DCMAKE_INSTALL_PREFIX=/build/source/target/aarch64-unknown-linux-gnu/release/build/aws-lc-fips-sys-996b9b2f671df0c5/out" "-DCMAKE_C_FLAGS= -ffile-prefix-map=\"/build/authentik-rust-2026.8.3-vendor/source-registry-0/aws-lc-fips-sys-0.14.2\"= -ffunction-sections -fdata-sections -fPIC --target=aarch64-unknown-linux-gnu -w" "-DCMAKE_C_COMPILER=/nix/store/7v2w6x6h13zzswz6agxxcrx73vqdd0px-clang-wrapper-21.1.8/bin/cc" "-DCMAKE_CXX_FLAGS= -ffunction-sections -fdata-sections -fPIC -w" "-DCMAKE_CXX_COMPILER=/nix/store/z2qkl46kv87zcs2sfwfjgc75nq0hbzhf-gcc-wrapper-15.3.0/bin/c++" "-DCMAKE_ASM_FLAGS= -ffunction-sections -fdata-sections -fPIC --target=aarch64-unknown-linux-gnu -w" "-DCMAKE_ASM_COMPILER=/nix/store/7v2w6x6h13zzswz6agxxcrx73vqdd0px-clang-wrapper-21.1.8/bin/cc" "-DCMAKE_BUILD_TYPE=Release" "--no-warn-unused-cli"853 The --no-warn-unused-cli option is deprecated. Use -Wno-unused-cli instead.854 CMake Warning (deprecated) at aws-lc/CMakeLists.txt:1 (cmake_minimum_required):855 Compatibility with CMake < 3.10 will be removed from a future version of856 CMake.857858 Update the VERSION argument <min> value. Or, use the <min>...<max> syntax859 to tell CMake that the project requires at least <min> but has been updated860 to work with policies introduced by <max> or earlier.861 This warning is for project developers. Use -Wno-author or -Wno-deprecated862 to suppress it.863864 running: cd "/build/source/target/aarch64-unknown-linux-gnu/release/build/aws-lc-fips-sys-996b9b2f671df0c5/out/build" && LC_ALL="C" MAKEFLAGS="-j --jobserver-fds=3,4 --jobserver-auth=3,4" "cmake" "--build" "/build/source/target/aarch64-unknown-linux-gnu/release/build/aws-lc-fips-sys-996b9b2f671df0c5/out/build" "--target" "install" "--config" "Release"865 /build/bcm-delocated-6d1b22.s:3119:10: error: fixup value out of range866 adr x3, .L.str.192867 ^868 /build/bcm-delocated-6d1b22.s:3255:10: error: fixup value out of range869 adr x3, .L.str.192870 ^871 /build/bcm-delocated-6d1b22.s:3415:10: error: fixup value out of range872 adr x3, .L.str.192873 ^874 /build/bcm-delocated-6d1b22.s:3906:10: error: fixup value out of range875 adr x3, .L.str.192876 ^877 /build/bcm-delocated-6d1b22.s:4012:10: error: fixup value out of range878 adr x3, .L.str.192879 ^880 /build/bcm-delocated-6d1b22.s:4098:10: error: fixup value out of range881 adr x3, .L.str.192882 ^883 /build/bcm-delocated-6d1b22.s:4190:10: error: fixup value out of range884 adr x3, .L.str.192885 ^886 /build/bcm-delocated-6d1b22.s:4285:10: error: fixup value out of range887 adr x3, .L.str.192888 ^889 /build/bcm-delocated-6d1b22.s:4581:10: error: fixup value out of range890 adr x3, .L.str.192891 ^892 /build/bcm-delocated-6d1b22.s:5119:10: error: fixup value out of range893 adr x3, .L.str.192894 ^895 /build/bcm-delocated-6d1b22.s:5522:10: error: fixup value out of range896 adr x3, .L.str.192897 ^898 /build/bcm-delocated-6d1b22.s:5641:10: error: fixup value out of range899 adr x3, .L.str.192900 ^901 make[2]: *** [aws-lc/crypto/fipsmodule/CMakeFiles/bcm_hashunset.dir/build.make:380: aws-lc/crypto/fipsmodule/CMakeFiles/bcm_hashunset.dir/bcm-delocated.S.o] Error 1902 make[1]: *** [CMakeFiles/Makefile2:403: aws-lc/crypto/fipsmodule/CMakeFiles/bcm_hashunset.dir/all] Error 2903 make: *** [Makefile:136: all] Error 2904905 thread 'main' (2617) panicked at /build/authentik-rust-2026.8.3-vendor/source-registry-0/cmake-0.1.57/src/lib.rs:1132:5:906907 command did not execute successfully, got: exit status: 2908909 build script failed, must exit now910 note: run with `RUST_BACKTRACE=1` environment variable to display a backtrace911warning: build failed, waiting for other jobs to finish...